program: Orca
programVersion: 5.0.2
elementType: F F F O O O O N C C C C C C C C C C C C C C C C C C C C C C C C H H H H H H H H H H H H H H H H H H H H H H H H
charge: 0
multiplicity: 1
keywords: wb97x-d3
keywords: def2-TZVPP
keywords: def2/J RIJCOSX
keywords: DEFGRID2
keywords: scfconv7
keywords: smallprint printgap noloewdin
keywords: NOSOSCF
formula: C24H24F3NO4
InChI: InChI=1/C24H24F3NO4/c1-22(2,3)16-9-11-17(12-10-16)23(15-28,21(30)32-14-13-31-4)20(29)18-7-5-6-8-19(18)24(25,26)27/h5-12H,13-14H2,1-4H3
56 atoms
F  0.825884 2.059297 2.527029
F  -0.79004 0.634014 2.547283
F  -1.111984 2.643696 3.231914
O  -0.718657 -2.882819 -1.320268
O  -3.026818 -0.257919 0.697581
O  -1.98566 -1.187661 -2.059688
O  -2.366437 -5.171119 -1.147552
N  -1.026704 -2.736934 1.985987
C  4.391932 1.585453 -0.458776
C  3.078943 0.826031 -0.333073
C  4.082381 3.086904 -0.515964
C  5.32362 1.331449 0.724157
C  5.110624 1.160773 -1.744225
C  -0.84504 -0.989337 0.059022
C  0.564422 -0.434659 -0.103619
C  2.112646 0.938982 -1.337005
C  2.766592 0.027529 0.760267
C  0.881554 0.322006 -1.232316
C  1.529405 -0.594402 0.877419
C  -1.938298 0.098219 0.345694
C  -1.270414 -1.699307 -1.241801
C  -1.599902 1.526693 0.060444
C  -0.93073 -1.967672 1.136855
C  -0.872099 2.344347 0.922451
C  -2.026822 2.034948 -1.162394
C  -0.539463 3.637117 0.536979
C  -0.48197 1.917163 2.302597
C  -1.02059 -3.717424 -2.458488
C  -1.690883 3.323651 -1.541715
C  -0.932591 4.120866 -0.699254
C  -2.361339 -4.389254 -2.317344
C  -3.605991 -5.809716 -0.941688
H  3.464288 3.345929 -1.376757
H  3.557763 3.416553 0.382883
H  5.007775 3.661426 -0.591772
H  5.599375 0.279185 0.813278
H  4.882017 1.647024 1.671133
H  6.245739 1.899085 0.590187
H  4.515692 1.364299 -2.635387
H  5.343368 0.094491 -1.733697
H  6.050851 1.705891 -1.848177
H  2.311938 1.531721 -2.220843
H  3.478987 -0.115668 1.56061
H  0.169043 0.456346 -2.035612
H  1.337438 -1.192242 1.759096
H  -2.602778 1.413749 -1.833747
H  0.025601 4.278465 1.20153
H  -0.216017 -4.449884 -2.478067
H  -0.981377 -3.139229 -3.381433
H  -2.020109 3.70024 -2.500442
H  -0.657942 5.12379 -0.995268
H  -3.17424 -3.65205 -2.300986
H  -2.510116 -5.003835 -3.21598
H  -4.425285 -5.088787 -0.834603
H  -3.859112 -6.490397 -1.763341
H  -3.535619 -6.390636 -0.022466
elementType: F O N C H
totalener: -1584.34391155 hartree
nucrepener: 3489.50520654 hartree
electener: -5073.84911809 hartree
oneelecener: -9109.82485348 hartree
twoeener: 4035.97573538 hartree
cpcmener: -0.04600655 hartree
kineticenergy: 1577.90513541 hartree
xcener: -146.962921370280 hartree
chargesum: 0.0000000
charge: -0.172699 -0.175717 -0.174981 -0.272972 -0.335387 -0.421784 -0.392990 -0.063192 0.344113 -0.095854 -0.335021 -0.359421 -0.330314 0.756970 -0.184999 -0.198362 -0.131920 -0.236941 -0.190291 0.239388 0.345521 0.152321 -0.366519 -0.122793 -0.198513 -0.147955 0.557979 0.000230 -0.130472 -0.142419 0.027201 -0.111253 0.098758 0.101155 0.099758 0.103254 0.101649 0.100928 0.098704 0.103508 0.098726 0.145833 0.147651 0.156904 0.136035 0.152660 0.146940 0.121827 0.112612 0.166732 0.166450 0.094042 0.105004 0.095895 0.096083 0.117939
qa: -0.1727 -0.1757 -0.1750 -0.2730 -0.3354 -0.4218 -0.3930 -0.0632 0.3441 -0.0959 -0.3350 -0.3594 -0.3303 0.7570 -0.1850 -0.1984 -0.1319 -0.2369 -0.1903 0.2394 0.3455 0.1523 -0.3665 -0.1228 -0.1985 -0.1480 0.5580 0.0002 -0.1305 -0.1424 0.0272 -0.1113 0.0988 0.1012 0.0998 0.1033 0.1016 0.1009 0.0987 0.1035 0.0987 0.1458 0.1477 0.1569 0.1360 0.1527 0.1469 0.1218 0.1126 0.1667 0.1664 0.0940 0.1050 0.0959 0.0961 0.1179
va: 1.1230 1.1227 1.1302 2.1836 2.1320 2.0615 1.8964 3.1000 3.6173 3.7739 3.9226 3.9277 3.9187 3.3224 3.6116 4.0439 3.9114 4.0903 3.9908 3.9811 4.2190 3.4163 4.1655 3.7497 3.9440 3.9624 4.4169 3.8904 3.9189 3.8976 3.8873 3.8972 1.0037 1.0053 1.0046 1.0004 1.0004 1.0067 1.0041 1.0030 1.0027 1.0041 0.9966 1.0046 1.0205 1.0178 1.0069 1.0042 1.0120 0.9867 0.9867 1.0039 0.9981 0.9906 0.9892 0.9908
dispcorr: -0.034634974 hartree
energy: -1584.378546527471
dipole: 28.00279 -26.38506 1.61773 -7.21279 9.13085 1.91807 -30.05773 26.58498 -3.47275
magnitude: 4.28440 au
magnitude: 10.89007 debye
