program: Orca
programVersion: 5.0.2
elementType: F F F O O O O N C C C C C C C C C C C C C C C C C C C C C C C C H H H H H H H H H H H H H H H H H H H H H H H H
charge: 0
multiplicity: 1
keywords: wb97x-d3
keywords: def2-TZVPP
keywords: def2/J RIJCOSX
keywords: DEFGRID2
keywords: scfconv7
keywords: smallprint printgap noloewdin
keywords: NOSOSCF
formula: C24H24F3NO4
InChI: InChI=1/C24H24F3NO4/c1-22(2,3)16-9-11-17(12-10-16)23(15-28,21(30)32-14-13-31-4)20(29)18-7-5-6-8-19(18)24(25,26)27/h5-12H,13-14H2,1-4H3
56 atoms
F  -4.161659 2.2797 0.064824
F  -5.204567 1.115116 1.531916
F  -3.799046 0.162648 0.211097
O  -0.812703 -0.507994 -2.379577
O  -1.400006 1.627606 -0.794305
O  -1.419509 -2.381172 -1.306763
O  1.271968 -2.199464 -3.078278
N  -1.54198 -1.996708 1.929839
C  5.247348 -0.231985 -0.096507
C  3.728478 -0.329391 -0.046718
C  5.675793 1.156464 0.393705
C  5.923325 -1.28232 0.781576
C  5.72114 -0.42947 -1.541649
C  -0.627472 -0.522782 -0.021534
C  0.907576 -0.433111 0.001726
C  2.950563 0.562576 -0.788704
C  3.051054 -1.276311 0.713433
C  1.568958 0.517711 -0.772546
C  1.662866 -1.330225 0.741194
C  -1.238724 0.894842 0.140105
C  -1.019899 -1.248592 -1.323815
C  -1.587649 1.301244 1.536999
C  -1.126223 -1.356196 1.070498
C  -2.915957 1.51124 1.915536
C  -0.569273 1.479683 2.464103
C  -3.208763 1.905673 3.211883
C  -4.025123 1.274223 0.934698
C  -0.755862 -1.128548 -3.677999
C  -0.86893 1.885315 3.756265
C  -2.185167 2.097603 4.128699
C  0.691282 -1.347256 -4.034327
C  2.670375 -2.298888 -3.222085
H  5.343978 1.334201 1.418245
H  6.764069 1.242352 0.375953
H  5.274885 1.955669 -0.231108
H  7.006689 -1.171019 0.715865
H  5.681127 -2.299272 0.467897
H  5.648795 -1.177874 1.832789
H  5.298166 0.313793 -2.218727
H  5.449618 -1.418181 -1.916716
H  6.808054 -0.339878 -1.596176
H  3.425847 1.317568 -1.402282
H  3.593449 -1.997287 1.308918
H  1.026765 1.234465 -1.372711
H  1.190123 -2.089133 1.350831
H  0.461309 1.311771 2.179971
H  -4.231809 2.061646 3.524558
H  -1.209698 -0.425783 -4.373881
H  -1.330915 -2.053566 -3.694646
H  -0.069712 2.027995 4.470437
H  -2.424488 2.404663 5.137406
H  0.734819 -1.774884 -5.044876
H  1.215006 -0.382737 -4.068471
H  2.950426 -2.776868 -4.16762
H  3.15401 -1.316787 -3.184211
H  3.049709 -2.90772 -2.402503
elementType: F O N C H
totalener: -1584.34434205 hartree
nucrepener: 3459.74950816 hartree
electener: -5044.09385022 hartree
oneelecener: -9050.81681843 hartree
twoeener: 4006.72296821 hartree
cpcmener: -0.04885660 hartree
kineticenergy: 1577.91040248 hartree
xcener: -146.965851358133 hartree
chargesum: -0.0000000
charge: -0.171456 -0.171464 -0.177639 -0.262714 -0.328962 -0.417488 -0.384002 -0.046424 0.380418 -0.082580 -0.330615 -0.364522 -0.362234 0.792340 -0.310113 -0.226064 -0.165232 -0.172873 -0.096191 0.205604 0.377082 0.021401 -0.377348 -0.196863 -0.148540 -0.079280 0.548021 0.010433 -0.128619 -0.138519 0.012349 -0.123618 0.104355 0.098573 0.099058 0.101441 0.103012 0.103024 0.104921 0.100556 0.106075 0.143914 0.146756 0.150122 0.135921 0.164877 0.150892 0.120544 0.111574 0.165741 0.167007 0.112937 0.098401 0.116675 0.092152 0.117180
qa: -0.1715 -0.1715 -0.1776 -0.2627 -0.3290 -0.4175 -0.3840 -0.0464 0.3804 -0.0826 -0.3306 -0.3645 -0.3622 0.7923 -0.3101 -0.2261 -0.1652 -0.1729 -0.0962 0.2056 0.3771 0.0214 -0.3773 -0.1969 -0.1485 -0.0793 0.5480 0.0104 -0.1286 -0.1385 0.0123 -0.1236 0.1044 0.0986 0.0991 0.1014 0.1030 0.1030 0.1049 0.1006 0.1061 0.1439 0.1468 0.1501 0.1359 0.1649 0.1509 0.1205 0.1116 0.1657 0.1670 0.1129 0.0984 0.1167 0.0922 0.1172
va: 1.1257 1.1361 1.1151 2.1975 2.1167 2.0800 1.9113 3.1080 3.5726 3.7253 3.9173 3.9303 3.9296 3.1461 3.7791 4.0257 3.9297 3.9412 3.9536 3.8855 4.2773 3.5261 4.1136 3.8879 3.9036 3.8972 4.4368 3.8445 3.9325 3.9034 3.9083 3.8981 1.0031 1.0032 1.0035 1.0065 0.9999 1.0004 0.9991 1.0027 1.0070 1.0055 0.9996 1.0209 1.0135 0.9906 1.0052 1.0021 1.0200 0.9890 0.9872 1.0032 0.9940 0.9921 0.9869 0.9896
dispcorr: -0.035252386 hartree
energy: -1584.379594439831
dipole: 73.30736 -69.81390 3.49346 -9.57965 11.40765 1.82800 -13.98934 13.56741 -0.42193
magnitude: 3.96533 au
magnitude: 10.07907 debye
