program: Orca
programVersion: 5.0.2
elementType: F F F O O O O N C C C C C C C C C C C C C C C C C C C C C C C C H H H H H H H H H H H H H H H H H H H H H H H H
charge: 0
multiplicity: 1
keywords: wb97x-d3
keywords: def2-TZVPP
keywords: def2/J RIJCOSX
keywords: DEFGRID2
keywords: scfconv7
keywords: smallprint printgap noloewdin
keywords: NOSOSCF
formula: C24H24F3NO4
InChI: InChI=1/C24H24F3NO4/c1-22(2,3)16-9-11-17(12-10-16)23(15-28,21(30)32-14-13-31-4)20(29)18-7-5-6-8-19(18)24(25,26)27/h5-12H,13-14H2,1-4H3
56 atoms
F  -4.505047 1.985231 0.237507
F  -5.130485 0.741831 1.871545
F  -3.801629 -0.041394 0.374587
O  -0.72883 -0.593407 -2.440045
O  -1.660372 1.517213 -0.967379
O  -1.461467 -2.403264 -1.334697
O  1.338441 -2.402568 -2.905969
N  -1.568214 -1.930525 1.920844
C  5.181424 -0.197107 -0.090217
C  3.658861 -0.222135 -0.068192
C  5.699881 0.055271 1.330018
C  5.701991 -1.551549 -0.588306
C  5.727445 0.891742 -1.011142
C  -0.687644 -0.509041 -0.085051
C  0.840653 -0.364281 -0.023881
C  2.874556 0.684647 -0.77547
C  2.989465 -1.194744 0.675782
C  1.48813 0.618561 -0.760665
C  1.607993 -1.271218 0.699099
C  -1.366973 0.883564 0.006481
C  -1.023363 -1.284996 -1.371507
C  -1.610802 1.39622 1.391594
C  -1.175079 -1.313817 1.033865
C  -2.905176 1.504234 1.906162
C  -0.525961 1.790805 2.163857
C  -3.097851 2.014476 3.181536
C  -4.088912 1.053323 1.101979
C  -0.582544 -1.265688 -3.705025
C  -0.727785 2.308065 3.435064
C  -2.010725 2.419207 3.942464
C  0.880144 -1.548782 -3.92458
C  2.74055 -2.545038 -2.907862
H  5.372791 -0.71647 2.028183
H  6.791757 0.06249 1.338009
H  5.35693 1.018589 1.71171
H  5.359079 -1.75906 -1.603742
H  5.38204 -2.377259 0.048195
H  6.793727 -1.552077 -0.599723
H  5.428395 1.892105 -0.693316
H  5.403398 0.753967 -2.044499
H  6.818067 0.862067 -1.00532
H  3.332596 1.465689 -1.36588
H  3.548945 -1.921975 1.250699
H  0.937099 1.34789 -1.338283
H  1.144301 -2.055446 1.283063
H  0.479507 1.707534 1.774167
H  -4.091475 2.09685 3.599674
H  -0.944908 -0.572954 -4.461855
H  -1.191086 -2.168616 -3.742052
H  0.122737 2.618736 4.026138
H  -2.172231 2.815349 4.935481
H  0.997858 -1.998493 -4.919501
H  1.442504 -0.605603 -3.927608
H  3.099895 -3.040562 -3.816704
H  3.247401 -1.577203 -2.827395
H  3.016304 -3.156756 -2.049911
elementType: F O N C H
totalener: -1584.34458862 hartree
nucrepener: 3467.32614119 hartree
electener: -5051.67072980 hartree
oneelecener: -9065.82772275 hartree
twoeener: 4014.15699295 hartree
cpcmener: -0.04949380 hartree
kineticenergy: 1577.90670701 hartree
xcener: -146.965550096154 hartree
chargesum: -0.0000000
charge: -0.172322 -0.171296 -0.177572 -0.264409 -0.325246 -0.417024 -0.383830 -0.049176 0.376223 -0.118437 -0.325618 -0.356330 -0.365892 0.809344 -0.310763 -0.151151 -0.190462 -0.148710 -0.142972 0.206115 0.369699 0.027821 -0.363625 -0.196300 -0.163677 -0.074113 0.547153 0.012493 -0.126555 -0.148105 0.010790 -0.121469 0.099029 0.098425 0.102855 0.103014 0.104107 0.103612 0.101816 0.104642 0.101856 0.147004 0.142467 0.145732 0.137627 0.164052 0.149549 0.120455 0.111347 0.166038 0.167351 0.112630 0.096727 0.116316 0.087462 0.121301
qa: -0.1723 -0.1713 -0.1776 -0.2644 -0.3252 -0.4170 -0.3838 -0.0492 0.3762 -0.1184 -0.3256 -0.3563 -0.3659 0.8093 -0.3108 -0.1512 -0.1905 -0.1487 -0.1430 0.2061 0.3697 0.0278 -0.3636 -0.1963 -0.1637 -0.0741 0.5472 0.0125 -0.1266 -0.1481 0.0108 -0.1215 0.0990 0.0984 0.1029 0.1030 0.1041 0.1036 0.1018 0.1046 0.1019 0.1470 0.1425 0.1457 0.1376 0.1641 0.1495 0.1205 0.1113 0.1660 0.1674 0.1126 0.0967 0.1163 0.0875 0.1213
va: 1.1241 1.1358 1.1145 2.1930 2.1226 2.0785 1.9136 3.1072 3.5754 3.7296 3.9133 3.9277 3.9328 3.0942 3.7401 3.8860 4.0114 3.9180 3.9727 3.9406 4.2821 3.5452 4.0890 3.8623 3.9176 3.9035 4.4347 3.8430 3.9337 3.9089 3.9124 3.9000 1.0033 1.0032 1.0038 1.0018 1.0018 1.0060 1.0006 0.9987 1.0063 0.9985 1.0051 1.0209 1.0112 0.9944 1.0054 1.0019 1.0197 0.9888 0.9870 1.0038 0.9932 0.9922 0.9907 0.9883
dispcorr: -0.035740261 hartree
energy: -1584.380328876483
dipole: 74.72591 -70.84906 3.87685 -8.25012 10.25493 2.00481 -14.30134 13.80902 -0.49231
magnitude: 4.39223 au
magnitude: 11.16415 debye
