program: Orca
programVersion: 5.0.2
elementType: F F F O O O O N C C C C C C C C C C C C C C C C C C C C C C C C H H H H H H H H H H H H H H H H H H H H H H H H
charge: 0
multiplicity: 1
keywords: wb97x-d3
keywords: def2-TZVPP
keywords: def2/J RIJCOSX
keywords: DEFGRID2
keywords: scfconv7
keywords: smallprint printgap noloewdin
keywords: NOSOSCF
formula: C24H24F3NO4
InChI: InChI=1/C24H24F3NO4/c1-22(2,3)16-9-11-17(12-10-16)23(15-28,21(30)32-14-13-31-4)20(29)18-7-5-6-8-19(18)24(25,26)27/h5-12H,13-14H2,1-4H3
56 atoms
F  -5.241981 1.458754 1.140883
F  -3.689505 0.77691 -0.181409
F  -3.899434 2.875127 0.245569
O  -0.92306 -1.66083 -1.939487
O  -0.943573 2.218706 -0.309539
O  -1.084009 0.507912 -2.485299
O  1.460759 -2.696355 -2.858943
N  -1.902167 -2.013064 1.154753
C  5.210652 -0.606232 0.083219
C  3.690441 -0.518732 0.044626
C  5.698543 -1.817518 0.875299
C  5.755192 -0.714177 -1.346557
C  5.764792 0.663034 0.741225
C  -0.64814 -0.159837 -0.186605
C  0.880867 -0.281504 -0.062193
C  3.07086 0.513897 -0.663569
C  2.860263 -1.426213 0.693653
C  1.694988 0.633589 -0.726211
C  1.475902 -1.313736 0.64486
C  -1.101923 1.222381 0.337315
C  -0.940803 -0.37225 -1.686298
C  -1.673455 1.265945 1.71977
C  -1.331188 -1.206859 0.56628
C  -3.029213 1.503992 1.951037
C  -0.806788 1.104046 2.792063
C  -3.501464 1.591534 3.252034
C  -3.971643 1.658081 0.796268
C  -0.790054 -2.105269 -3.30392
C  -1.284613 1.198811 4.090966
C  -2.628164 1.44343 4.319764
C  0.643929 -1.981951 -3.754354
C  2.833402 -2.500894 -3.106587
H  5.349609 -2.757798 0.444262
H  6.789324 -1.842053 0.869882
H  5.379426 -1.784603 1.918501
H  5.476353 0.142455 -1.961368
H  5.392314 -1.616099 -1.842671
H  6.845852 -0.761121 -1.329347
H  6.855177 0.621698 0.781597
H  5.397523 0.773584 1.76311
H  5.491331 1.562966 0.188523
H  3.668844 1.247113 -1.189905
H  3.27679 -2.249466 1.256894
H  1.274413 1.446329 -1.302316
H  0.8810 -2.05036 1.16857
H  0.244195 0.913234 2.616152
H  -4.549256 1.771372 3.448874
H  -1.452386 -1.549936 -3.967789
H  -1.112816 -3.14423 -3.286653
H  -0.602286 1.079712 4.92135
H  -3.004996 1.51443 5.33063
H  0.709243 -2.38151 -4.775603
H  0.947773 -0.928023 -3.806865
H  3.11248 -1.44319 -3.044242
H  3.391153 -3.05405 -2.35187
H  3.130258 -2.870811 -4.094727
elementType: F O N C H
totalener: -1584.34481767 hartree
nucrepener: 3447.94503388 hartree
electener: -5032.28985155 hartree
oneelecener: -9027.10461838 hartree
twoeener: 3994.81476683 hartree
cpcmener: -0.04763852 hartree
kineticenergy: 1577.89303755 hartree
xcener: -146.961155354228 hartree
chargesum: -0.0000000
charge: -0.170441 -0.179129 -0.172262 -0.263173 -0.337122 -0.400920 -0.391946 -0.052095 0.376348 -0.122663 -0.364086 -0.359789 -0.327611 0.811844 -0.289650 -0.212216 -0.113675 -0.204374 -0.158561 0.278108 0.384201 0.054618 -0.446581 -0.193158 -0.138273 -0.081017 0.546932 0.009740 -0.140479 -0.139941 0.005246 -0.118911 0.103452 0.101542 0.102155 0.105211 0.101777 0.105076 0.098437 0.103893 0.099169 0.143469 0.146768 0.147626 0.133276 0.164770 0.151012 0.110949 0.118134 0.165984 0.167747 0.114465 0.101949 0.091441 0.118325 0.114405
qa: -0.1704 -0.1791 -0.1723 -0.2632 -0.3371 -0.4009 -0.3919 -0.0521 0.3763 -0.1227 -0.3641 -0.3598 -0.3276 0.8118 -0.2897 -0.2122 -0.1137 -0.2044 -0.1586 0.2781 0.3842 0.0546 -0.4466 -0.1932 -0.1383 -0.0810 0.5469 0.0097 -0.1405 -0.1399 0.0052 -0.1189 0.1035 0.1015 0.1022 0.1052 0.1018 0.1051 0.0984 0.1039 0.0992 0.1435 0.1468 0.1476 0.1333 0.1648 0.1510 0.1109 0.1181 0.1660 0.1677 0.1145 0.1019 0.0914 0.1183 0.1144
va: 1.1385 1.1142 1.1244 2.1767 2.1156 2.1044 1.8870 3.1096 3.5817 3.7630 3.9299 3.9268 3.9157 3.1454 3.7570 4.0368 3.8855 4.0319 3.9526 3.8139 4.2491 3.5548 4.1978 3.8741 3.9073 3.9007 4.4375 3.8798 3.9333 3.9032 3.8902 3.8980 1.0002 1.0066 1.0007 1.0007 1.0027 1.0067 1.0033 1.0035 1.0034 1.0047 0.9984 1.0289 1.0198 0.9887 1.0048 1.0123 1.0021 0.9885 0.9869 1.0026 0.9962 0.9872 0.9885 0.9934
dispcorr: -0.035204320 hartree
energy: -1584.380021987158
dipole: 71.57505 -68.71178 2.86327 -21.00492 20.39508 -0.60984 -9.23326 9.89404 0.66078
magnitude: 3.00114 au
magnitude: 7.62830 debye
