program: Orca
programVersion: 5.0.2
elementType: F F F O O O O N C C C C C C C C C C C C C C C C C C C C C C C C H H H H H H H H H H H H H H H H H H H H H H H H
charge: 0
multiplicity: 1
keywords: wb97x-d3
keywords: def2-TZVPP
keywords: def2/J RIJCOSX
keywords: DEFGRID2
keywords: scfconv7
keywords: smallprint printgap noloewdin
keywords: NOSOSCF
formula: C24H24F3NO4
InChI: InChI=1/C24H24F3NO4/c1-22(2,3)16-9-11-17(12-10-16)23(15-28,21(30)32-14-13-31-4)20(29)18-7-5-6-8-19(18)24(25,26)27/h5-12H,13-14H2,1-4H3
56 atoms
F  -4.667944 2.024822 1.195985
F  -3.470084 1.023965 -0.273942
F  -3.153712 3.117274 0.15202
O  -1.548549 -0.689895 -2.166661
O  -0.755868 1.841029 -0.739352
O  0.602215 -0.446902 -2.747494
O  -2.540087 -3.124699 -3.207503
N  -1.304078 -2.383845 0.719354
C  5.694167 -0.215999 0.858054
C  4.205595 -0.302329 0.547282
C  6.474917 -0.243689 -0.46093
C  5.988244 1.095501 1.594953
C  6.171653 -1.374409 1.731171
C  -0.034594 -0.400338 -0.40582
C  1.451776 -0.389088 -0.072544
C  3.586844 0.718602 -0.179098
C  3.406982 -1.369037 0.943585
C  2.239037 0.684808 -0.483192
C  2.051827 -1.416037 0.639144
C  -0.686651 0.938761 0.051012
C  -0.270687 -0.514148 -1.930348
C  -1.167057 1.045839 1.456067
C  -0.735693 -1.513029 0.22789
C  -2.434997 1.556625 1.772184
C  -0.312185 0.665939 2.484642
C  -2.807939 1.685533 3.10076
C  -3.428296 1.93354 0.70991
C  -1.998452 -0.833517 -3.529591
C  -0.6906 0.809342 3.810052
C  -1.937481 1.320116 4.117178
C  -1.823452 -2.240675 -4.035201
C  -2.453829 -4.45802 -3.656518
H  6.210924 0.593353 -1.108855
H  7.547836 -0.183827 -0.26759
H  6.286948 -1.166385 -1.012759
H  5.433497 1.157237 2.532551
H  5.733009 1.971259 0.997341
H  7.051619 1.162581 1.83207
H  7.237447 -1.262679 1.935282
H  6.035022 -2.342358 1.246209
H  5.65638 -1.402783 2.692807
H  4.163587 1.568446 -0.52116
H  3.825431 -2.192547 1.505099
H  1.817798 1.508744 -1.043239
H  1.479378 -2.269331 0.97881
H  0.671665 0.27822 2.262658
H  -3.783651 2.065561 3.366817
H  -1.478871 -0.131564 -4.181982
H  -3.05086 -0.558343 -3.498699
H  -0.00715 0.518935 4.595313
H  -2.246438 1.430364 5.146991
H  -2.199964 -2.258704 -5.067418
H  -0.762179 -2.517003 -4.080787
H  -2.897861 -4.584904 -4.649865
H  -1.417394 -4.809653 -3.701397
H  -2.999497 -5.085347 -2.952925
elementType: F O N C H
totalener: -1584.34831369 hartree
nucrepener: 3370.52988957 hartree
electener: -4954.87820326 hartree
oneelecener: -8872.54022464 hartree
twoeener: 3917.66202137 hartree
cpcmener: -0.04518412 hartree
kineticenergy: 1577.89762331 hartree
xcener: -146.961049815679 hartree
chargesum: -0.0000000
charge: -0.175611 -0.177386 -0.173082 -0.265205 -0.345007 -0.409406 -0.392887 -0.060144 0.328338 -0.118576 -0.329887 -0.332838 -0.357484 0.850184 -0.207703 -0.184597 -0.114774 -0.187514 -0.183183 0.227391 0.343250 0.084388 -0.418953 -0.234245 -0.208900 -0.044835 0.534874 -0.005673 -0.108653 -0.150064 0.033473 -0.111012 0.098582 0.098523 0.103548 0.103869 0.098356 0.098148 0.101358 0.100082 0.104959 0.148632 0.148940 0.154532 0.134976 0.183042 0.149892 0.110956 0.118743 0.165145 0.167818 0.102404 0.094283 0.096896 0.094329 0.117706
qa: -0.1756 -0.1774 -0.1731 -0.2652 -0.3450 -0.4094 -0.3929 -0.0601 0.3283 -0.1186 -0.3299 -0.3328 -0.3575 0.8502 -0.2077 -0.1846 -0.1148 -0.1875 -0.1832 0.2274 0.3433 0.0844 -0.4190 -0.2342 -0.2089 -0.0448 0.5349 -0.0057 -0.1087 -0.1501 0.0335 -0.1110 0.0986 0.0985 0.1035 0.1039 0.0984 0.0981 0.1014 0.1001 0.1050 0.1486 0.1489 0.1545 0.1350 0.1830 0.1499 0.1110 0.1187 0.1651 0.1678 0.1024 0.0943 0.0969 0.0943 0.1177
va: 1.1273 1.1201 1.1207 2.1773 2.1040 2.0952 1.8977 3.1027 3.6476 3.8157 3.9197 3.9186 3.9260 3.1343 3.7755 4.0429 3.9036 4.0274 4.0045 3.7760 4.2471 3.4458 4.2002 3.9329 3.9238 3.8456 4.4514 3.8900 3.9216 3.9225 3.8865 3.8987 1.0036 1.0027 1.0034 1.0031 1.0041 1.0030 1.0063 1.0008 1.0005 1.0006 0.9969 1.0158 1.0199 0.9834 1.0065 1.0132 1.0052 0.9897 0.9875 0.9979 1.0038 0.9894 0.9903 0.9910
dispcorr: -0.030939380 hartree
energy: -1584.379253072705
dipole: 55.97225 -54.30823 1.66402 -22.79858 22.62664 -0.17194 -3.81168 4.92501 1.11333
magnitude: 2.00949 au
magnitude: 5.10771 debye
