program: Orca
programVersion: 5.0.2
elementType: F F F O O O O N C C C C C C C C C C C C C C C C C C C C C C C C H H H H H H H H H H H H H H H H H H H H H H H H
charge: 0
multiplicity: 1
keywords: wb97x-d3
keywords: def2-TZVPP
keywords: def2/J RIJCOSX
keywords: DEFGRID2
keywords: scfconv7
keywords: smallprint printgap noloewdin
keywords: NOSOSCF
formula: C24H24F3NO4
InChI: InChI=1/C24H24F3NO4/c1-22(2,3)16-9-11-17(12-10-16)23(15-28,21(30)32-14-13-31-4)20(29)18-7-5-6-8-19(18)24(25,26)27/h5-12H,13-14H2,1-4H3
56 atoms
F  -5.20374 1.344383 1.156009
F  -3.668477 0.67403 -0.192225
F  -3.923942 2.775533 0.195214
O  -1.085418 -1.73413 -1.891637
O  -0.95462 2.19447 -0.436616
O  -0.911953 0.400437 -2.561421
O  1.337455 -1.823912 -3.296787
N  -1.791631 -1.998379 1.206333
C  5.267118 -0.517836 0.13769
C  3.751688 -0.3916 0.053221
C  5.711869 -0.29349 1.587498
C  5.677667 -1.925324 -0.311178
C  5.983009 0.495659 -0.752532
C  -0.595747 -0.174534 -0.227964
C  0.936979 -0.247067 -0.09404
C  3.113895 0.557186 -0.741146
C  2.936969 -1.259527 0.781113
C  1.730969 0.631962 -0.81941
C  1.554991 -1.195552 0.712239
C  -1.07402 1.219654 0.249235
C  -0.901946 -0.446397 -1.714734
C  -1.613147 1.293615 1.643526
C  -1.248598 -1.202971 0.578101
C  -2.972667 1.470483 1.905165
C  -0.712059 1.205304 2.695807
C  -3.416163 1.55908 3.216091
C  -3.949082 1.568942 0.773263
C  -0.986295 -2.300248 -3.213131
C  -1.161002 1.305485 4.004271
C  -2.509976 1.478798 4.263176
C  0.398528 -2.86759 -3.38419
C  2.657574 -2.289816 -3.129007
H  5.262681 -1.015582 2.270498
H  6.795903 -0.394174 1.670445
H  5.442583 0.706167 1.933263
H  5.358873 -2.122094 -1.336957
H  5.252597 -2.701667 0.326145
H  6.763774 -2.029766 -0.273808
H  7.062175 0.36521 -0.659513
H  5.754985 1.525732 -0.473091
H  5.729635 0.367195 -1.806601
H  3.687826 1.259191 -1.329438
H  3.379353 -2.014485 1.418844
H  1.297128 1.384599 -1.462484
H  0.975844 -1.89846 1.296239
H  0.342649 1.066552 2.497166
H  -4.466343 1.688893 3.437164
H  -1.231057 -1.561242 -3.97494
H  -1.72342 -3.099777 -3.257276
H  -0.452214 1.243947 4.818565
H  -2.865184 1.548755 5.281722
H  0.581518 -3.627719 -2.613475
H  0.444824 -3.376476 -4.356329
H  2.768401 -2.87336 -2.208358
H  2.981335 -2.914935 -3.968397
H  3.314392 -1.422903 -3.075653
elementType: F O N C H
totalener: -1584.34455645 hartree
nucrepener: 3452.26010887 hartree
electener: -5036.60466532 hartree
oneelecener: -9036.10592450 hartree
twoeener: 3999.50125919 hartree
cpcmener: -0.04889996 hartree
kineticenergy: 1577.89464362 hartree
xcener: -146.962259813761 hartree
chargesum: -0.0000000
charge: -0.170356 -0.178954 -0.172464 -0.264422 -0.335972 -0.405337 -0.384264 -0.051305 0.365783 -0.107676 -0.328549 -0.343279 -0.363886 0.836179 -0.294510 -0.194468 -0.160557 -0.179126 -0.168778 0.257391 0.368756 0.061436 -0.458110 -0.187187 -0.125174 -0.086582 0.548593 0.019837 -0.148784 -0.135620 0.026920 -0.125973 0.099420 0.098373 0.103396 0.099801 0.101433 0.101668 0.101527 0.102827 0.103178 0.146489 0.143350 0.143518 0.135389 0.166219 0.151248 0.109710 0.122815 0.165674 0.167891 0.091185 0.100294 0.099431 0.117857 0.113740
qa: -0.1704 -0.1790 -0.1725 -0.2644 -0.3360 -0.4053 -0.3843 -0.0513 0.3658 -0.1077 -0.3285 -0.3433 -0.3639 0.8362 -0.2945 -0.1945 -0.1606 -0.1791 -0.1688 0.2574 0.3688 0.0614 -0.4581 -0.1872 -0.1252 -0.0866 0.5486 0.0198 -0.1488 -0.1356 0.0269 -0.1260 0.0994 0.0984 0.1034 0.0998 0.1014 0.1017 0.1015 0.1028 0.1032 0.1465 0.1434 0.1435 0.1354 0.1662 0.1512 0.1097 0.1228 0.1657 0.1679 0.0912 0.1003 0.0994 0.1179 0.1137
va: 1.1389 1.1144 1.1245 2.1697 2.1199 2.0974 1.9173 3.1093 3.5916 3.7589 3.9160 3.9256 3.9311 3.0762 3.7585 3.9487 4.0046 4.0283 3.9278 3.8680 4.2703 3.5454 4.1957 3.8685 3.8967 3.9049 4.4339 3.8342 3.9406 3.8991 3.9217 3.9002 1.0033 1.0032 1.0032 1.0036 1.0028 1.0051 1.0064 1.0006 0.9994 0.9994 1.0040 1.0341 1.0179 0.9866 1.0047 1.0205 1.0014 0.9888 0.9867 0.9968 1.0020 0.9882 0.9917 0.9898
dispcorr: -0.035033116 hartree
energy: -1584.379589561149
dipole: 70.76874 -68.09984 2.66890 -23.11937 21.28683 -1.83254 -6.70385 8.03011 1.32626
magnitude: 3.49859 au
magnitude: 8.89272 debye
