program: Orca
programVersion: 5.0.2
elementType: F F F O O O O N C C C C C C C C C C C C C C C C C C C C C C C C H H H H H H H H H H H H H H H H H H H H H H H H
charge: 0
multiplicity: 1
keywords: wb97x-d3
keywords: def2-TZVPP
keywords: def2/J RIJCOSX
keywords: DEFGRID2
keywords: scfconv7
keywords: smallprint printgap noloewdin
keywords: NOSOSCF
formula: C24H24F3NO4
InChI: InChI=1/C24H24F3NO4/c1-22(2,3)16-9-11-17(12-10-16)23(15-28,21(30)32-14-13-31-4)20(29)18-7-5-6-8-19(18)24(25,26)27/h5-12H,13-14H2,1-4H3
56 atoms
F  -3.028198 3.219947 -0.242756
F  -4.688495 2.19774 0.642966
F  -3.360116 1.126565 -0.650277
O  -1.488667 -0.878133 -1.988074
O  -0.608286 1.772833 -0.842004
O  0.668965 -0.8577 -2.595871
O  -2.770555 -3.330331 -2.621009
N  -1.152995 -2.359639 1.015828
C  5.807271 -0.053671 0.762947
C  4.306132 -0.173874 0.534805
C  6.315384 -1.042982 1.809848
C  6.536382 -0.328015 -0.558198
C  6.137457 1.36567 1.239535
C  0.045458 -0.439682 -0.281497
C  1.53395 -0.352094 0.029691
C  3.669485 0.68682 -0.363771
C  3.512548 -1.117814 1.177052
C  2.312712 0.608698 -0.613226
C  2.147881 -1.209596 0.929645
C  -0.638609 0.928322 0.012133
C  -0.200208 -0.748223 -1.78051
C  -1.267021 1.141619 1.344459
C  -0.615301 -1.507476 0.461026
C  -2.546585 1.698556 1.490916
C  -0.529415 0.820337 2.479225
C  -3.052854 1.916889 2.76336
C  -3.402868 2.059537 0.307603
C  -1.957554 -1.208716 -3.309342
C  -1.037138 1.060597 3.745979
C  -2.299713 1.606478 3.886857
C  -1.922357 -2.694862 -3.546512
C  -2.747819 -4.733213 -2.755971
H  5.848786 -0.885801 2.784002
H  6.144234 -2.079988 1.515931
H  7.391263 -0.916365 1.940014
H  6.239891 0.368264 -1.34375
H  6.33823 -1.3399 -0.916382
H  7.615103 -0.228653 -0.421402
H  5.634532 1.59496 2.180742
H  5.845746 2.123629 0.511732
H  7.212299 1.466646 1.402391
H  4.240492 1.440161 -0.891769
H  3.942922 -1.809857 1.887297
H  1.876759 1.302975 -1.318129
H  1.579409 -1.96551 1.456291
H  0.464891 0.404728 2.384274
H  -4.042079 2.3302 2.899203
H  -1.372097 -0.690358 -4.068288
H  -2.976999 -0.828677 -3.344556
H  -0.44259 0.817537 4.615581
H  -2.710425 1.789832 4.870088
H  -2.251257 -2.869943 -4.579746
H  -0.896009 -3.077042 -3.471045
H  -1.75723 -5.149198 -2.540426
H  -3.4594 -5.150831 -2.044607
H  -3.037878 -5.053944 -3.762882
elementType: F O N C H
totalener: -1584.34791766 hartree
nucrepener: 3369.35026077 hartree
electener: -4953.69817842 hartree
oneelecener: -8870.17879256 hartree
twoeener: 3916.48061414 hartree
cpcmener: -0.04457036 hartree
kineticenergy: 1577.88229548 hartree
xcener: -146.957935534162 hartree
chargesum: -0.0000000
charge: -0.173996 -0.176701 -0.174427 -0.261183 -0.347453 -0.404353 -0.393069 -0.061257 0.323135 -0.121282 -0.358582 -0.328858 -0.329265 0.844844 -0.168047 -0.181587 -0.108588 -0.206606 -0.214149 0.220897 0.334572 0.111425 -0.416087 -0.237827 -0.222022 -0.045421 0.534643 -0.002624 -0.108781 -0.151841 0.034234 -0.112874 0.103469 0.100948 0.101207 0.098456 0.103534 0.098159 0.103338 0.098175 0.097882 0.148010 0.148859 0.151099 0.140797 0.192582 0.150366 0.109864 0.116220 0.165736 0.167779 0.102901 0.092678 0.097449 0.117864 0.095757
qa: -0.1740 -0.1767 -0.1744 -0.2612 -0.3475 -0.4044 -0.3931 -0.0613 0.3231 -0.1213 -0.3586 -0.3289 -0.3293 0.8448 -0.1680 -0.1816 -0.1086 -0.2066 -0.2141 0.2209 0.3346 0.1114 -0.4161 -0.2378 -0.2220 -0.0454 0.5346 -0.0026 -0.1088 -0.1518 0.0342 -0.1129 0.1035 0.1009 0.1012 0.0985 0.1035 0.0982 0.1033 0.0982 0.0979 0.1480 0.1489 0.1511 0.1408 0.1926 0.1504 0.1099 0.1162 0.1657 0.1678 0.1029 0.0927 0.0974 0.1179 0.0958
va: 1.1185 1.1259 1.1235 2.1802 2.1057 2.1004 1.8970 3.1007 3.6533 3.8247 3.9266 3.9189 3.9190 3.1591 3.7109 4.0457 3.9062 4.0505 4.0020 3.8054 4.2570 3.4252 4.1936 3.9456 3.9180 3.8455 4.4508 3.8887 3.9224 3.9281 3.8934 3.8984 1.0007 1.0009 1.0065 1.0039 1.0034 1.0029 1.0032 1.0042 1.0030 1.0006 0.9971 1.0213 1.0179 0.9748 1.0063 1.0149 1.0070 0.9893 0.9875 0.9987 1.0016 0.9902 0.9910 0.9895
dispcorr: -0.030850953 hartree
energy: -1584.378768611870
dipole: 54.88764 -53.56323 1.32441 -23.36832 23.20189 -0.16643 -0.02300 1.22972 1.20672
magnitude: 1.79943 au
magnitude: 4.57378 debye
