program: Orca
programVersion: 5.0.2
elementType: F F F O O O O N C C C C C C C C C C C C C C C C C C C C C C C C H H H H H H H H H H H H H H H H H H H H H H H H
charge: 0
multiplicity: 1
keywords: wb97x-d3
keywords: def2-TZVPP
keywords: def2/J RIJCOSX
keywords: DEFGRID2
keywords: scfconv7
keywords: smallprint printgap noloewdin
keywords: NOSOSCF
formula: C24H24F3NO4
InChI: InChI=1/C24H24F3NO4/c1-22(2,3)16-9-11-17(12-10-16)23(15-28,21(30)32-14-13-31-4)20(29)18-7-5-6-8-19(18)24(25,26)27/h5-12H,13-14H2,1-4H3
56 atoms
F  -4.719234 1.497674 1.293726
F  -3.39072 0.695216 -0.188254
F  -3.451752 2.818846 0.176836
O  -1.593226 -0.668557 -2.16659
O  -0.805688 1.902708 -0.758153
O  0.542015 -0.373206 -2.78293
O  -2.600734 -3.106101 -3.141706
N  -1.331202 -2.288168 0.746871
C  5.663509 -0.222591 0.84438
C  4.184426 -0.245119 0.483228
C  6.37158 1.01757 0.302252
C  5.802294 -0.232504 2.371708
C  6.349475 -1.463817 0.261453
C  -0.061745 -0.338062 -0.432668
C  1.42715 -0.329865 -0.112973
C  3.387393 -1.323387 0.870203
C  3.56181 0.784063 -0.217908
C  2.03424 -1.369603 0.582102
C  2.207201 0.747728 -0.513477
C  -0.695203 1.004109 0.031062
C  -0.316514 -0.463707 -1.953161
C  -1.111628 1.124386 1.459069
C  -0.761375 -1.433869 0.229069
C  -2.423432 1.464754 1.813124
C  -0.160159 0.942974 2.456548
C  -2.753782 1.63092 3.149216
C  -3.496682 1.622813 0.774152
C  -2.073534 -0.821479 -3.516255
C  -0.497704 1.122603 3.789838
C  -1.7915 1.468209 4.135462
C  -1.90898 -2.2363 -4.004882
C  -2.496845 -4.451917 -3.547091
H  7.425685 0.988131 0.582216
H  6.32509 1.074105 -0.786937
H  5.954056 1.94119 0.706885
H  5.315677 0.636262 2.818902
H  6.856428 -0.206531 2.655562
H  5.364836 -1.127251 2.816832
H  5.932622 -2.389929 0.659164
H  7.414019 -1.454402 0.504092
H  6.256665 -1.494426 -0.825749
H  3.819642 -2.152333 1.416498
H  4.125394 1.645131 -0.548481
H  1.464942 -2.228828 0.912191
H  1.778823 1.579426 -1.056894
H  0.857617 0.683432 2.200775
H  -3.76375 1.882937 3.440899
H  -1.567922 -0.127867 -4.188095
H  -3.12477 -0.544355 -3.46501
H  0.256493 0.989725 4.553132
H  -2.0644 1.60426 5.172808
H  -2.311882 -2.275343 -5.026209
H  -0.847573 -2.508304 -4.071542
H  -2.946948 -4.619559 -4.531912
H  -1.454935 -4.788146 -3.589491
H  -3.026199 -5.063611 -2.817558
elementType: F O N C H
totalener: -1584.34818010 hartree
nucrepener: 3383.23646233 hartree
electener: -4967.58464243 hartree
oneelecener: -8897.99428549 hartree
twoeener: 3930.40964307 hartree
cpcmener: -0.04515874 hartree
kineticenergy: 1577.89073037 hartree
xcener: -146.958985226226 hartree
chargesum: -0.0000000
charge: -0.174527 -0.174399 -0.173438 -0.258934 -0.337783 -0.409793 -0.392813 -0.062117 0.333575 -0.122350 -0.359550 -0.330534 -0.330285 0.847761 -0.234940 -0.138382 -0.155954 -0.196223 -0.159250 0.231212 0.347967 0.065272 -0.417102 -0.221799 -0.184863 -0.054018 0.535976 -0.007503 -0.113695 -0.150556 0.034451 -0.111039 0.100987 0.104095 0.101286 0.103035 0.098307 0.098141 0.097942 0.098418 0.103774 0.146002 0.151137 0.135811 0.152716 0.167327 0.149548 0.110878 0.118117 0.164508 0.167572 0.103101 0.093755 0.096847 0.094683 0.117647
qa: -0.1745 -0.1744 -0.1734 -0.2589 -0.3378 -0.4098 -0.3928 -0.0621 0.3336 -0.1224 -0.3595 -0.3305 -0.3303 0.8478 -0.2349 -0.1384 -0.1560 -0.1962 -0.1592 0.2312 0.3480 0.0653 -0.4171 -0.2218 -0.1849 -0.0540 0.5360 -0.0075 -0.1137 -0.1506 0.0345 -0.1110 0.1010 0.1041 0.1013 0.1030 0.0983 0.0981 0.0979 0.0984 0.1038 0.1460 0.1511 0.1358 0.1527 0.1673 0.1495 0.1109 0.1181 0.1645 0.1676 0.1031 0.0938 0.0968 0.0947 0.1176
va: 1.1300 1.1208 1.1213 2.1812 2.1088 2.0952 1.8978 3.1012 3.6400 3.8208 3.9285 3.9199 3.9185 3.1175 3.7555 3.9997 3.9458 4.0007 4.0022 3.7649 4.2515 3.4511 4.1762 3.9068 3.9339 3.8679 4.4501 3.8926 3.9255 3.9171 3.8865 3.8983 1.0064 1.0002 1.0004 1.0037 1.0030 1.0036 1.0040 1.0029 1.0027 1.0018 0.9966 1.0174 1.0178 0.9927 1.0060 1.0135 1.0054 0.9899 0.9873 0.9983 1.0031 0.9893 0.9904 0.9910
dispcorr: -0.031368628 hartree
energy: -1584.379548728451
dipole: 56.40277 -54.60545 1.79732 -20.87593 20.78392 -0.09201 -3.71469 4.79309 1.07839
magnitude: 2.09804 au
magnitude: 5.33279 debye
