program: Orca
programVersion: 5.0.2
elementType: F F F O O O O N C C C C C C C C C C C C C C C C C C C C C C C C H H H H H H H H H H H H H H H H H H H H H H H H
charge: 0
multiplicity: 1
keywords: wb97x-d3
keywords: def2-TZVPP
keywords: def2/J RIJCOSX
keywords: DEFGRID2
keywords: scfconv7
keywords: smallprint printgap noloewdin
keywords: NOSOSCF
formula: C24H24F3NO4
InChI: InChI=1/C24H24F3NO4/c1-22(2,3)16-9-11-17(12-10-16)23(15-28,21(30)32-14-13-31-4)20(29)18-7-5-6-8-19(18)24(25,26)27/h5-12H,13-14H2,1-4H3
56 atoms
F  -4.059194 1.39944 -0.190988
F  -4.831663 0.227454 1.43273
F  -3.286854 -0.577704 0.178222
O  0.202804 -1.135093 -2.253873
O  -1.117494 1.067388 -1.016152
O  -1.075383 -2.601702 -1.131274
O  -2.448731 -0.697917 -3.270372
N  -0.871359 -2.166557 2.123564
C  5.718185 0.326127 0.424729
C  4.228304 0.019745 0.352394
C  6.340167 0.124978 -0.962636
C  5.916464 1.781641 0.865063
C  6.446015 -0.57843 1.417458
C  -0.0417 -0.79512 0.061956
C  1.45488 -0.486728 0.173936
C  3.394979 0.78848 -0.464009
C  3.632295 -1.011923 1.069359
C  2.035652 0.54821 -0.556198
C  2.269423 -1.263141 0.984773
C  -0.867942 0.523395 0.022449
C  -0.372973 -1.62791 -1.190123
C  -1.314116 1.077477 1.336976
C  -0.499964 -1.571502 1.212679
C  -2.666866 1.122743 1.685592
C  -0.360663 1.595407 2.204056
C  -3.048565 1.705002 2.884847
C  -3.714641 0.54608 0.779452
C  -0.198474 -1.608912 -3.554963
C  -0.751967 2.183989 3.39765
C  -2.092994 2.24138 3.735402
C  -1.306106 -0.72512 -4.09114
C  -3.321113 -1.792094 -3.457196
H  6.226773 -0.906498 -1.301392
H  5.888153 0.775632 -1.712579
H  7.408191 0.350206 -0.932925
H  5.478865 2.489172 0.159768
H  6.981633 2.01042 0.93743
H  5.469512 1.964573 1.843903
H  7.50487 -0.316822 1.440938
H  6.378976 -1.632634 1.142747
H  6.060286 -0.468109 2.432659
H  3.80737 1.601852 -1.047792
H  4.220447 -1.646132 1.717594
H  1.447643 1.18229 -1.205046
H  1.862032 -2.081518 1.563842
H  0.688819 1.559319 1.943696
H  -4.090509 1.744654 3.170748
H  -0.473079 -2.662567 -3.513632
H  0.681049 -1.510688 -4.189184
H  -0.003141 2.597091 4.059358
H  -2.403289 2.698748 4.664647
H  -0.942805 0.301841 -4.168214
H  -1.5403 -1.064277 -5.108306
H  -3.761354 -1.787309 -4.460041
H  -2.835246 -2.760536 -3.306551
H  -4.124846 -1.699965 -2.727425
elementType: F O N C H
totalener: -1584.34505790 hartree
nucrepener: 3448.23986063 hartree
electener: -5032.58491853 hartree
oneelecener: -9028.65145270 hartree
twoeener: 3996.06653416 hartree
cpcmener: -0.04983975 hartree
kineticenergy: 1577.88362303 hartree
xcener: -146.959305008931 hartree
chargesum: 0.0000000
charge: -0.175311 -0.172686 -0.179939 -0.251036 -0.330345 -0.422142 -0.396028 -0.049726 0.328896 -0.109295 -0.329785 -0.330847 -0.359647 0.779319 -0.270213 -0.162020 -0.143002 -0.187443 -0.139399 0.226056 0.364864 0.021051 -0.350871 -0.205077 -0.167924 -0.068509 0.553040 -0.022739 -0.120290 -0.150228 0.033064 -0.111052 0.104003 0.099154 0.098411 0.098530 0.097821 0.104158 0.101083 0.101183 0.104596 0.147206 0.148829 0.150929 0.138212 0.160756 0.149320 0.116080 0.121658 0.166331 0.167389 0.107144 0.103306 0.107601 0.093492 0.112070
qa: -0.1753 -0.1727 -0.1799 -0.2510 -0.3303 -0.4221 -0.3960 -0.0497 0.3289 -0.1093 -0.3298 -0.3308 -0.3596 0.7793 -0.2702 -0.1620 -0.1430 -0.1874 -0.1394 0.2261 0.3649 0.0211 -0.3509 -0.2051 -0.1679 -0.0685 0.5530 -0.0227 -0.1203 -0.1502 0.0331 -0.1111 0.1040 0.0992 0.0984 0.0985 0.0978 0.1042 0.1011 0.1012 0.1046 0.1472 0.1488 0.1509 0.1382 0.1608 0.1493 0.1161 0.1217 0.1663 0.1674 0.1071 0.1033 0.1076 0.0935 0.1121
va: 1.1199 1.1356 1.1160 2.1973 2.1146 2.0736 1.8932 3.1072 3.6442 3.7989 3.9186 3.9181 3.9265 3.2295 3.8276 4.0237 3.9292 3.9890 3.9988 3.8256 4.2381 3.5108 4.0915 3.8831 3.9237 3.8982 4.4218 3.8140 3.9260 3.9166 3.8933 3.8882 1.0031 1.0036 1.0030 1.0040 1.0032 1.0030 1.0065 1.0004 1.0002 1.0013 0.9976 1.0162 1.0126 0.9955 1.0060 1.0045 1.0070 0.9888 0.9872 1.0020 1.0059 0.9948 0.9891 0.9933
dispcorr: -0.033379806 hartree
energy: -1584.378437704671
dipole: 58.65213 -55.72197 2.93017 0.81088 0.73127 1.54215 -10.60575 10.13206 -0.47369
magnitude: 3.34492 au
magnitude: 8.50210 debye
