program: Orca
programVersion: 5.0.2
elementType: F F F O O O O N C C C C C C C C C C C C C C C C C C C C C C C C H H H H H H H H H H H H H H H H H H H H H H H H
charge: 0
multiplicity: 1
keywords: wb97x-d3
keywords: def2-TZVPP
keywords: def2/J RIJCOSX
keywords: DEFGRID2
keywords: scfconv7
keywords: smallprint printgap noloewdin
keywords: NOSOSCF
formula: C24H24F3NO4
InChI: InChI=1/C24H24F3NO4/c1-22(2,3)16-9-11-17(12-10-16)23(15-28,21(30)32-14-13-31-4)20(29)18-7-5-6-8-19(18)24(25,26)27/h5-12H,13-14H2,1-4H3
56 atoms
F  -0.623891 1.209384 2.292282
F  -1.102308 3.291596 2.083069
F  0.788612 2.562374 1.380767
O  -1.028694 -2.349855 -1.123366
O  -2.672994 -0.925911 1.090101
O  -0.163165 -3.644451 0.491466
O  -3.71262 -2.808604 -1.735542
N  -0.308545 -1.92804 3.355721
C  4.529967 1.605868 -0.762129
C  3.293533 0.799707 -0.390827
C  5.795148 0.801507 -0.445549
C  4.55463 1.975947 -2.243762
C  4.524872 2.898947 0.063806
C  -0.33534 -1.259998 0.834487
C  0.954201 -0.57284 0.40281
C  2.262523 0.542783 -1.289298
C  3.137346 0.316543 0.908461
C  1.114388 -0.134316 -0.907059
C  1.993673 -0.35609 1.301429
C  -1.666697 -0.454085 0.634952
C  -0.500808 -2.580715 0.05229
C  -1.686983 0.77255 -0.21661
C  -0.30501 -1.639119 2.243273
C  -1.121122 1.999077 0.128385
C  -2.33069 0.643607 -1.445084
C  -1.157654 3.057711 -0.769987
C  -0.509728 2.262479 1.468345
C  -1.445817 -3.460917 -1.943788
C  -2.357845 1.700642 -2.338739
C  -1.758612 2.905404 -2.007641
C  -2.833726 -3.891183 -1.54776
C  -4.968037 -3.006782 -1.127899
H  6.682957 1.38087 -0.706899
H  5.872239 0.548817 0.612495
H  5.825634 -0.128954 -1.015371
H  5.4604 2.542943 -2.463656
H  3.70569 2.599937 -2.528632
H  4.557451 1.094261 -2.88732
H  3.624625 3.486113 -0.128297
H  5.388469 3.516847 -0.190818
H  4.568381 2.697303 1.13518
H  2.32826 0.876963 -2.314977
H  3.911524 0.479203 1.647709
H  0.349808 -0.295524 -1.653283
H  1.923435 -0.693384 2.327241
H  -2.791512 -0.295692 -1.716944
H  -0.722049 4.013144 -0.507027
H  -0.745414 -4.291721 -1.865599
H  -1.420985 -3.081361 -2.963507
H  -2.849715 1.579307 -3.294015
H  -1.771703 3.733153 -2.702976
H  -3.113882 -4.752611 -2.168448
H  -2.844938 -4.233198 -0.504485
H  -5.571573 -2.119955 -1.315889
H  -5.492547 -3.875459 -1.540326
H  -4.879325 -3.143411 -0.044724
elementType: F O N C H
totalener: -1584.34270347 hartree
nucrepener: 3539.47783052 hartree
electener: -5123.82053399 hartree
oneelecener: -9209.33595926 hartree
twoeener: 4085.51542528 hartree
cpcmener: -0.04492009 hartree
kineticenergy: 1577.91583564 hartree
xcener: -146.966015957273 hartree
chargesum: -0.0000000
charge: -0.173236 -0.174291 -0.169220 -0.252623 -0.349203 -0.410358 -0.382571 -0.054118 0.340341 -0.107052 -0.329776 -0.361661 -0.336073 0.691414 -0.202597 -0.155543 -0.152876 -0.192232 -0.206687 0.228259 0.346933 0.099629 -0.302522 -0.099763 -0.205196 -0.145240 0.558659 -0.008796 -0.149727 -0.129187 0.019752 -0.110160 0.098833 0.098087 0.103170 0.101618 0.100354 0.105280 0.100646 0.099731 0.099983 0.148061 0.144463 0.155929 0.133720 0.147361 0.146401 0.119089 0.121336 0.165018 0.167754 0.108500 0.096377 0.111065 0.106037 0.096910
qa: -0.1732 -0.1743 -0.1692 -0.2526 -0.3492 -0.4104 -0.3826 -0.0541 0.3403 -0.1071 -0.3298 -0.3617 -0.3361 0.6914 -0.2026 -0.1555 -0.1529 -0.1922 -0.2067 0.2283 0.3469 0.0996 -0.3025 -0.0998 -0.2052 -0.1452 0.5587 -0.0088 -0.1497 -0.1292 0.0198 -0.1102 0.0988 0.0981 0.1032 0.1016 0.1004 0.1053 0.1006 0.0997 0.1000 0.1481 0.1445 0.1559 0.1337 0.1474 0.1464 0.1191 0.1213 0.1650 0.1678 0.1085 0.0964 0.1111 0.1060 0.0969
va: 1.1270 1.1334 1.1241 2.1876 2.1136 2.0943 1.9109 3.1082 3.6231 3.7809 3.9176 3.9288 3.9224 3.4213 3.5440 3.9424 4.0105 4.0428 4.0431 3.9540 4.2753 3.3902 4.1014 3.7332 3.9292 3.9784 4.4088 3.8496 3.9610 3.8836 3.9100 3.8876 1.0027 1.0043 1.0026 1.0064 1.0004 1.0005 1.0059 1.0043 1.0026 0.9981 1.0028 1.0025 1.0167 1.0311 1.0065 1.0160 1.0047 0.9880 0.9859 1.0019 0.9983 0.9912 0.9908 0.9924
dispcorr: -0.036046381 hartree
energy: -1584.378749850009
dipole: 21.87303 -21.65769 0.21534 -5.70946 7.09258 1.38313 -30.29265 25.73144 -4.56120
magnitude: 4.77116 au
magnitude: 12.12733 debye
