program: Orca
programVersion: 5.0.2
elementType: F F F O O O O N C C C C C C C C C C C C C C C C C C C C C C C C H H H H H H H H H H H H H H H H H H H H H H H H
charge: 0
multiplicity: 1
keywords: wb97x-d3
keywords: def2-TZVPP
keywords: def2/J RIJCOSX
keywords: DEFGRID2
keywords: scfconv7
keywords: smallprint printgap noloewdin
keywords: NOSOSCF
formula: C24H24F3NO4
InChI: InChI=1/C24H24F3NO4/c1-22(2,3)16-9-11-17(12-10-16)23(15-28,21(30)32-14-13-31-4)20(29)18-7-5-6-8-19(18)24(25,26)27/h5-12H,13-14H2,1-4H3
56 atoms
F  -0.757265 1.230425 2.287805
F  -1.257824 3.309052 2.079238
F  0.680138 2.619072 1.479062
O  -1.047037 -2.341942 -1.127356
O  -2.716599 -0.876584 1.003948
O  -0.178184 -3.613783 0.502694
O  -3.726149 -2.856666 -1.667775
N  -0.408595 -1.87657 3.346988
C  4.531615 1.586017 -0.766428
C  3.296972 0.80893 -0.330777
C  5.502199 1.827034 0.387263
C  5.265239 0.806666 -1.864087
C  4.087988 2.947004 -1.317309
C  -0.371319 -1.226715 0.821323
C  0.93031 -0.544569 0.417487
C  2.299945 0.510048 -1.262457
C  3.089649 0.380612 0.974956
C  1.142324 -0.15514 -0.905562
C  1.927464 -0.284108 1.345428
C  -1.693357 -0.416342 0.577158
C  -0.517611 -2.556447 0.049839
C  -1.672339 0.809634 -0.276151
C  -0.377145 -1.592309 2.23379
C  -1.142493 2.039957 0.109569
C  -2.235759 0.678781 -1.543131
C  -1.136262 3.103904 -0.783638
C  -0.615251 2.297703 1.486075
C  -1.453369 -3.460569 -1.941107
C  -2.217987 1.74036 -2.431853
C  -1.656491 2.951034 -2.057474
C  -2.824054 -3.925855 -1.525671
C  -4.975519 -3.112237 -1.070266
H  5.048775 2.408093 1.192328
H  5.876915 0.894599 0.812923
H  6.364618 2.38969 0.026696
H  4.639335 0.645536 -2.742656
H  5.595494 -0.169324 -1.50446
H  6.149581 1.357983 -2.189495
H  3.554542 3.524964 -0.560527
H  3.431894 2.844505 -2.182596
H  4.956315 3.529188 -1.631673
H  2.416357 0.806505 -2.297357
H  3.828835 0.567573 1.741135
H  0.410506 -0.351805 -1.675877
H  1.818386 -0.581128 2.380262
H  -2.673592 -0.262134 -1.845864
H  -0.729912 4.063121 -0.489356
H  -0.732928 -4.274888 -1.877715
H  -1.453707 -3.077834 -2.959266
H  -2.645169 1.618365 -3.417816
H  -1.63588 3.782249 -2.748814
H  -3.100013 -4.776501 -2.162363
H  -2.807386 -4.29452 -0.49223
H  -5.604693 -2.237356 -1.225249
H  -5.475066 -3.979471 -1.515522
H  -4.883736 -3.287646 0.006789
elementType: F O N C H
totalener: -1584.34312785 hartree
nucrepener: 3533.83486527 hartree
electener: -5118.17799312 hartree
oneelecener: -9198.11137486 hartree
twoeener: 4079.93338174 hartree
cpcmener: -0.04593379 hartree
kineticenergy: 1577.91623846 hartree
xcener: -146.965731703969 hartree
chargesum: -0.0000000
charge: -0.173163 -0.174347 -0.169721 -0.251339 -0.347574 -0.410546 -0.382864 -0.054222 0.341593 -0.111208 -0.360387 -0.330884 -0.333482 0.698887 -0.194854 -0.170191 -0.128797 -0.236999 -0.183614 0.232949 0.345481 0.117421 -0.308264 -0.110246 -0.208973 -0.142030 0.554687 -0.010745 -0.143060 -0.133944 0.019580 -0.111288 0.102529 0.102283 0.101800 0.098643 0.102858 0.098952 0.100793 0.099068 0.099227 0.145261 0.147312 0.159507 0.132200 0.140112 0.146373 0.120272 0.122040 0.165778 0.167705 0.109844 0.095976 0.111900 0.104054 0.097658
qa: -0.1732 -0.1743 -0.1697 -0.2513 -0.3476 -0.4105 -0.3829 -0.0542 0.3416 -0.1112 -0.3604 -0.3309 -0.3335 0.6989 -0.1949 -0.1702 -0.1288 -0.2370 -0.1836 0.2329 0.3455 0.1174 -0.3083 -0.1102 -0.2090 -0.1420 0.5547 -0.0107 -0.1431 -0.1339 0.0196 -0.1113 0.1025 0.1023 0.1018 0.0986 0.1029 0.0990 0.1008 0.0991 0.0992 0.1453 0.1473 0.1595 0.1322 0.1401 0.1464 0.1203 0.1220 0.1658 0.1677 0.1098 0.0960 0.1119 0.1041 0.0977
va: 1.1270 1.1333 1.1237 2.1853 2.1137 2.0949 1.9067 3.1072 3.6248 3.7935 3.9277 3.9183 3.9207 3.4073 3.5548 4.0363 3.9178 4.0549 4.0345 3.9536 4.2722 3.3926 4.1037 3.7395 3.9366 3.9750 4.4171 3.8464 3.9493 3.8874 3.9091 3.8897 1.0002 1.0003 1.0064 1.0039 1.0034 1.0027 1.0057 1.0035 1.0037 1.0027 0.9972 1.0004 1.0188 1.0353 1.0065 1.0149 1.0042 0.9874 0.9860 1.0014 0.9991 0.9917 0.9906 0.9920
dispcorr: -0.035793669 hartree
energy: -1584.378921520011
dipole: 23.01467 -22.63254 0.38213 -6.53415 7.84420 1.31005 -30.80001 26.14593 -4.65409
magnitude: 4.85003 au
magnitude: 12.32779 debye
