program: Orca
programVersion: 5.0.2
elementType: F F F O O O O N C C C C C C C C C C C C C C C C C C C C C C C C H H H H H H H H H H H H H H H H H H H H H H H H
charge: 0
multiplicity: 1
keywords: wb97x-d3
keywords: def2-TZVPP
keywords: def2/J RIJCOSX
keywords: DEFGRID2
keywords: scfconv7
keywords: smallprint printgap noloewdin
keywords: NOSOSCF
formula: C24H24F3NO4
InChI: InChI=1/C24H24F3NO4/c1-22(2,3)16-9-11-17(12-10-16)23(15-28,21(30)32-14-13-31-4)20(29)18-7-5-6-8-19(18)24(25,26)27/h5-12H,13-14H2,1-4H3
56 atoms
F  -3.410779 -0.085989 -0.178385
F  -3.469103 2.020121 -0.641335
F  -4.742776 1.217703 0.882851
O  -1.342701 -2.027411 -1.488303
O  -0.871318 0.921877 -1.193968
O  0.766397 -1.842107 -2.224122
O  -2.81741 -0.521318 -3.407873
N  -0.859034 -2.391521 1.830467
C  5.825793 0.388149 0.62496
C  4.355466 0.019214 0.475339
C  6.580673 -0.047571 -0.637052
C  5.952115 1.907059 0.794686
C  6.471931 -0.286107 1.833142
C  0.147843 -0.915017 -0.068968
C  1.62489 -0.607565 0.135531
C  3.59836 0.58672 -0.553308
C  3.706909 -0.874399 1.320707
C  2.260262 0.286385 -0.724487
C  2.362517 -1.185985 1.156336
C  -0.662413 0.414338 -0.125825
C  -0.089316 -1.651802 -1.408333
C  -1.11409 1.007543 1.166065
C  -0.401742 -1.742834 0.997987
C  -2.447596 1.381609 1.388018
C  -0.172995 1.218558 2.168109
C  -2.804201 1.960347 2.596394
C  -3.517162 1.136161 0.361094
C  -1.817782 -2.642636 -2.701914
C  -0.537088 1.810954 3.367442
C  -1.85198 2.180908 3.5813
C  -2.02877 -1.618311 -3.799173
C  -4.193606 -0.80956 -3.290466
H  6.191803 0.435689 -1.534482
H  7.637314 0.215212 -0.555096
H  6.516588 -1.127321 -0.78357
H  5.418609 2.252369 1.68206
H  5.559105 2.451435 -0.064771
H  7.001404 2.187503 0.906514
H  7.518765 0.01366 1.902259
H  6.45075 -1.374817 1.759338
H  5.98872 -0.001143 2.76956
H  4.056035 1.284357 -1.243366
H  4.23762 -1.34925 2.133902
H  1.724529 0.762089 -1.535097
H  1.907405 -1.883921 1.847295
H  0.860631 0.94418 2.011178
H  -3.829087 2.241786 2.791868
H  -2.746356 -3.128609 -2.409861
H  -1.125258 -3.414689 -3.040456
H  0.211356 1.977413 4.129512
H  -2.148625 2.636127 4.516098
H  -1.071684 -1.21321 -4.130582
H  -2.466596 -2.15054 -4.654302
H  -4.605637 -1.191825 -4.23069
H  -4.417801 -1.536828 -2.50462
H  -4.705007 0.120492 -3.045666
elementType: F O N C H
totalener: -1584.34731175 hartree
nucrepener: 3436.00479860 hartree
electener: -5020.35211034 hartree
oneelecener: -9003.86544143 hartree
twoeener: 3983.51333108 hartree
cpcmener: -0.04785967 hartree
kineticenergy: 1577.88644443 hartree
xcener: -146.960110005226 hartree
chargesum: -0.0000000
charge: -0.180699 -0.179329 -0.176147 -0.261243 -0.340144 -0.405009 -0.406286 -0.059696 0.330383 -0.124764 -0.329403 -0.332655 -0.359505 0.869791 -0.208461 -0.179103 -0.110263 -0.197643 -0.183847 0.217539 0.326496 0.073545 -0.417574 -0.235591 -0.191154 -0.043704 0.547193 -0.033162 -0.111666 -0.148928 0.033355 -0.126972 0.098786 0.098248 0.103523 0.103519 0.099403 0.098101 0.101406 0.100985 0.104059 0.148765 0.148372 0.151475 0.134178 0.178117 0.148736 0.132165 0.120067 0.164227 0.167592 0.111706 0.104369 0.110733 0.099769 0.116347
qa: -0.1807 -0.1793 -0.1761 -0.2612 -0.3401 -0.4050 -0.4063 -0.0597 0.3304 -0.1248 -0.3294 -0.3327 -0.3595 0.8698 -0.2085 -0.1791 -0.1103 -0.1976 -0.1838 0.2175 0.3265 0.0735 -0.4176 -0.2356 -0.1912 -0.0437 0.5472 -0.0332 -0.1117 -0.1489 0.0334 -0.1270 0.0988 0.0982 0.1035 0.1035 0.0994 0.0981 0.1014 0.1010 0.1041 0.1488 0.1484 0.1515 0.1342 0.1781 0.1487 0.1322 0.1201 0.1642 0.1676 0.1117 0.1044 0.1107 0.0998 0.1163
va: 1.1225 1.1139 1.1295 2.1639 2.1006 2.0966 1.8747 3.1106 3.6455 3.8264 3.9183 3.9186 3.9273 3.0990 3.7464 4.0364 3.9003 4.0272 4.0021 3.7668 4.2629 3.4423 4.2035 3.9435 3.9195 3.8563 4.4137 3.8282 3.9237 3.9232 3.8682 3.8916 1.0037 1.0028 1.0033 1.0034 1.0038 1.0028 1.0065 1.0006 1.0003 1.0004 0.9970 1.0181 1.0202 0.9862 1.0068 0.9903 1.0147 0.9901 0.9875 1.0106 1.0026 0.9961 0.9845 0.9935
dispcorr: -0.033125486 hartree
energy: -1584.380437233058
dipole: 52.19481 -51.21472 0.98009 -3.47401 3.85331 0.37931 -3.00780 4.20516 1.19736
magnitude: 1.59315 au
magnitude: 4.04946 debye
