program: Orca
programVersion: 5.0.2
elementType: F F F O O O O N C C C C C C C C C C C C C C C C C C C C C C C C H H H H H H H H H H H H H H H H H H H H H H H H
charge: 0
multiplicity: 1
keywords: wb97x-d3
keywords: def2-TZVPP
keywords: def2/J RIJCOSX
keywords: DEFGRID2
keywords: scfconv7
keywords: smallprint printgap noloewdin
keywords: NOSOSCF
formula: C24H24F3NO4
InChI: InChI=1/C24H24F3NO4/c1-22(2,3)16-9-11-17(12-10-16)23(15-28,21(30)32-14-13-31-4)20(29)18-7-5-6-8-19(18)24(25,26)27/h5-12H,13-14H2,1-4H3
56 atoms
F  -4.797348 0.867577 0.969474
F  -3.354815 -0.201986 -0.203263
F  -3.632515 1.912511 -0.494814
O  -1.294704 -1.892244 -1.597264
O  -0.894558 1.061364 -1.131427
O  0.805136 -1.607599 -2.326752
O  -2.827039 -0.365376 -3.465656
N  -0.796927 -2.456598 1.67021
C  5.855777 0.381588 0.676891
C  4.372914 0.100901 0.466658
C  6.416488 1.348695 -0.363975
C  6.064783 0.990803 2.068464
C  6.636181 -0.935007 0.579497
C  0.165824 -0.820923 -0.11893
C  1.63592 -0.496181 0.112925
C  3.620424 0.709314 -0.535096
C  3.710339 -0.803996 1.297277
C  2.274149 0.422458 -0.711276
C  2.369538 -1.102817 1.126475
C  -0.681207 0.485896 -0.09965
C  -0.051545 -1.487759 -1.499097
C  -1.166814 0.971891 1.224775
C  -0.363214 -1.731126 0.890069
C  -2.523726 1.218723 1.475213
C  -0.234029 1.201734 2.230029
C  -2.915216 1.684831 2.72136
C  -3.576943 0.953325 0.436049
C  -1.753822 -2.475434 -2.831509
C  -0.633711 1.686179 3.465816
C  -1.973533 1.92378 3.712132
C  -2.002257 -1.421338 -3.892287
C  -4.190979 -0.705944 -3.344426
H  5.93262 2.326101 -0.323924
H  7.480278 1.50568 -0.179179
H  6.316158 0.962561 -1.38002
H  5.722769 0.32502 2.862134
H  5.531959 1.937563 2.172294
H  7.125712 1.18575 2.238087
H  7.702965 -0.751097 0.721935
H  6.506636 -1.402091 -0.398514
H  6.325859 -1.655525 1.337212
H  4.075238 1.423669 -1.207046
H  4.24341 -1.298342 2.099549
H  1.740149 0.928228 -1.504798
H  1.909129 -1.81551 1.79831
H  0.816724 1.025134 2.04755
H  -3.9585 1.861353 2.941484
H  -2.664918 -3.002585 -2.555836
H  -1.037462 -3.211044 -3.200287
H  0.106764 1.871027 4.231535
H  -2.296639 2.288784 4.677216
H  -1.060052 -0.973043 -4.210751
H  -2.423208 -1.940177 -4.764163
H  -4.590191 -1.109904 -4.281528
H  -4.386204 -1.436016 -2.553328
H  -4.737083 0.205864 -3.104458
elementType: F O N C H
totalener: -1584.34723052 hartree
nucrepener: 3434.72519177 hartree
electener: -5019.07242229 hartree
oneelecener: -9001.25056777 hartree
twoeener: 3982.17814548 hartree
cpcmener: -0.04750026 hartree
kineticenergy: 1577.88200456 hartree
xcener: -146.958906103347 hartree
chargesum: -0.0000000
charge: -0.176135 -0.178590 -0.180480 -0.257681 -0.337803 -0.404318 -0.406019 -0.060338 0.330222 -0.120629 -0.359934 -0.331202 -0.331308 0.871737 -0.208770 -0.158563 -0.132137 -0.172794 -0.218399 0.216659 0.325506 0.068069 -0.416775 -0.230088 -0.178649 -0.049156 0.548486 -0.036573 -0.114292 -0.148086 0.032655 -0.128038 0.101003 0.101018 0.104295 0.098985 0.103217 0.098432 0.098235 0.103843 0.097673 0.151258 0.146242 0.148777 0.136462 0.176874 0.148753 0.132852 0.120515 0.164709 0.166756 0.111436 0.104803 0.110632 0.098647 0.118005
qa: -0.1761 -0.1786 -0.1805 -0.2577 -0.3378 -0.4043 -0.4060 -0.0603 0.3302 -0.1206 -0.3599 -0.3312 -0.3313 0.8717 -0.2088 -0.1586 -0.1321 -0.1728 -0.2184 0.2167 0.3255 0.0681 -0.4168 -0.2301 -0.1786 -0.0492 0.5485 -0.0366 -0.1143 -0.1481 0.0327 -0.1280 0.1010 0.1010 0.1043 0.0990 0.1032 0.0984 0.0982 0.1038 0.0977 0.1513 0.1462 0.1488 0.1365 0.1769 0.1488 0.1329 0.1205 0.1647 0.1668 0.1114 0.1048 0.1106 0.0986 0.1180
va: 1.1299 1.1239 1.1137 2.1639 2.1025 2.0976 1.8740 3.1110 3.6429 3.8204 3.9274 3.9189 3.9200 3.1028 3.7234 3.9438 3.9998 4.0199 4.0032 3.7727 4.2625 3.4518 4.1980 3.9371 3.9192 3.8676 4.4145 3.8248 3.9240 3.9203 3.8696 3.8917 1.0006 1.0064 1.0003 1.0033 1.0036 1.0028 1.0028 1.0028 1.0041 0.9964 1.0014 1.0210 1.0190 0.9844 1.0065 0.9901 1.0147 0.9900 0.9877 1.0105 1.0026 0.9959 0.9853 0.9923
dispcorr: -0.033170749 hartree
energy: -1584.380401269503
dipole: 52.70243 -51.74014 0.96230 -2.88819 3.15028 0.26209 -2.69548 3.98811 1.29263
magnitude: 1.63267 au
magnitude: 4.14991 debye
