program: Orca
programVersion: 5.0.2
elementType: F F F O O O O N C C C C C C C C C C C C C C C C C C C C C C C C H H H H H H H H H H H H H H H H H H H H H H H H
charge: 0
multiplicity: 1
keywords: wb97x-d3
keywords: def2-TZVPP
keywords: def2/J RIJCOSX
keywords: DEFGRID2
keywords: scfconv7
keywords: smallprint printgap noloewdin
keywords: NOSOSCF
formula: C24H24F3NO4
InChI: InChI=1/C24H24F3NO4/c1-22(2,3)16-9-11-17(12-10-16)23(15-28,21(30)32-14-13-31-4)20(29)18-7-5-6-8-19(18)24(25,26)27/h5-12H,13-14H2,1-4H3
56 atoms
F  -0.45386 0.981005 2.735331
F  -0.710071 3.107681 2.897793
F  0.787261 2.319711 1.583913
O  -0.65794 -3.30694 -0.191695
O  -2.961752 -0.735324 2.081219
O  -2.516333 -2.142198 -0.666249
O  1.051231 -3.183863 -2.363021
N  -0.351806 -2.599845 3.132118
C  3.661495 1.36598 -1.523603
C  2.468938 0.639184 -0.918954
C  3.339996 1.973013 -2.887485
C  4.078926 2.49627 -0.5739
C  4.824462 0.383029 -1.694725
C  -0.941191 -1.288189 0.95713
C  0.274614 -0.63748 0.309805
C  1.227388 0.574214 -1.54458
C  2.589592 0.016627 0.323818
C  0.147781 -0.05664 -0.946632
C  1.516553 -0.610611 0.931571
C  -2.121647 -0.335762 1.323513
C  -1.492765 -2.306915 -0.061725
C  -2.241228 0.983072 0.630743
C  -0.5973 -2.017062 2.17185
C  -1.459866 2.100264 0.920139
C  -3.212622 1.070844 -0.363003
C  -1.625694 3.27152 0.191153
C  -0.456208 2.122734 2.030001
C  -0.816483 -4.201656 -1.310743
C  -3.369279 2.239445 -1.089393
C  -2.56783 3.33798 -0.820686
C  -0.285655 -3.569672 -2.573086
C  1.593597 -2.504357 -3.471483
H  4.221608 2.484838 -3.276273
H  3.054568 1.214022 -3.618544
H  2.53546 2.708872 -2.833246
H  4.925367 3.04686 -0.989317
H  4.38193 2.118316 0.403539
H  3.262996 3.20507 -0.419282
H  5.687837 0.891167 -2.129014
H  4.552231 -0.439551 -2.359429
H  5.14233 -0.047681 -0.744322
H  1.0742 1.020719 -2.516856
H  3.536663 0.02944 0.848575
H  -0.792766 -0.078672 -1.482569
H  1.663768 -1.065183 1.902865
H  -3.836478 0.216625 -0.586122
H  -1.021818 4.142325 0.41259
H  -1.859694 -4.491322 -1.437356
H  -0.245205 -5.08667 -1.038037
H  -4.119825 2.289095 -1.866517
H  -2.682546 4.251264 -1.387932
H  -0.375309 -4.312703 -3.377356
H  -0.899707 -2.708838 -2.869656
H  1.015997 -1.609141 -3.728673
H  2.607497 -2.196607 -3.214502
H  1.640761 -3.143197 -4.360977
elementType: F O N C H
totalener: -1584.34384315 hartree
nucrepener: 3585.00307329 hartree
electener: -5169.34691644 hartree
oneelecener: -9300.50847197 hartree
twoeener: 4131.16155553 hartree
cpcmener: -0.04681051 hartree
kineticenergy: 1577.91903034 hartree
xcener: -146.967991875748 hartree
chargesum: -0.0000000
charge: -0.177594 -0.174728 -0.168749 -0.266059 -0.341706 -0.406211 -0.390578 -0.060187 0.360349 -0.092845 -0.360737 -0.335556 -0.330713 0.767035 -0.178650 -0.191728 -0.146771 -0.298931 -0.167683 0.231691 0.351637 0.141445 -0.366599 -0.124558 -0.192497 -0.150992 0.562860 0.011571 -0.142488 -0.132074 -0.001251 -0.121677 0.101823 0.101510 0.102543 0.099617 0.099531 0.100625 0.100135 0.098993 0.098552 0.150216 0.142694 0.153339 0.132942 0.149923 0.147763 0.112342 0.120051 0.166307 0.167662 0.118590 0.104349 0.095429 0.116358 0.113676
qa: -0.1776 -0.1747 -0.1687 -0.2661 -0.3417 -0.4062 -0.3906 -0.0602 0.3603 -0.0928 -0.3607 -0.3356 -0.3307 0.7670 -0.1786 -0.1917 -0.1468 -0.2989 -0.1677 0.2317 0.3516 0.1414 -0.3666 -0.1246 -0.1925 -0.1510 0.5629 0.0116 -0.1425 -0.1321 -0.0013 -0.1217 0.1018 0.1015 0.1025 0.0996 0.0995 0.1006 0.1001 0.0990 0.0986 0.1502 0.1427 0.1533 0.1329 0.1499 0.1478 0.1123 0.1201 0.1663 0.1677 0.1186 0.1043 0.0954 0.1164 0.1137
va: 1.1218 1.1328 1.1235 2.1903 2.1235 2.0788 1.8851 3.1076 3.5943 3.7329 3.9320 3.9190 3.9240 3.2667 3.4089 3.8677 4.0079 4.0020 3.9898 3.9768 4.2403 3.4338 4.1692 3.7338 3.9542 3.9827 4.4088 3.8807 3.9331 3.8958 3.8849 3.8953 1.0067 1.0003 1.0009 1.0041 1.0030 1.0060 1.0029 1.0039 1.0043 0.9970 1.0026 1.0057 1.0187 1.0192 1.0064 1.0121 1.0017 0.9875 0.9862 1.0023 0.9975 0.9877 0.9900 0.9931
dispcorr: -0.037797520 hartree
energy: -1584.381640674654
dipole: 31.90354 -31.13847 0.76507 -3.73631 5.38662 1.65031 -44.91843 40.22139 -4.69704
magnitude: 5.03697 au
magnitude: 12.80296 debye
