program: Orca
programVersion: 5.0.2
elementType: F F F O O O O N C C C C C C C C C C C C C C C C C C C C C C C C H H H H H H H H H H H H H H H H H H H H H H H H
charge: 0
multiplicity: 1
keywords: wb97x-d3
keywords: def2-TZVPP
keywords: def2/J RIJCOSX
keywords: DEFGRID2
keywords: scfconv7
keywords: smallprint printgap noloewdin
keywords: NOSOSCF
formula: C24H24F3NO4
InChI: InChI=1/C24H24F3NO4/c1-22(2,3)16-9-11-17(12-10-16)23(15-28,21(30)32-14-13-31-4)20(29)18-7-5-6-8-19(18)24(25,26)27/h5-12H,13-14H2,1-4H3
56 atoms
F  -3.528119 2.265244 -0.31575
F  -4.68078 1.09241 1.06237
F  -3.241701 0.139124 -0.218895
O  -1.388028 -0.394309 -2.409552
O  -0.631538 1.908873 -1.021673
O  0.678798 -1.237584 -2.655942
O  -2.04545 -3.081227 -2.568829
N  -1.301598 -2.206153 0.76099
C  5.682933 -0.029946 0.892702
C  4.201817 -0.145013 0.555925
C  6.098535 -0.985424 2.009601
C  6.508152 -0.35709 -0.35807
C  5.989253 1.402859 1.344547
C  -0.000473 -0.340999 -0.518752
C  1.472555 -0.307898 -0.133422
C  3.348066 -1.042015 1.187685
C  3.649274 0.672285 -0.43576
C  2.001639 -1.124522 0.851961
C  2.313137 0.598048 -0.777536
C  -0.604587 1.047258 -0.187864
C  -0.180026 -0.703672 -2.013547
C  -1.048677 1.285204 1.22282
C  -0.726161 -1.376029 0.211657
C  -2.399259 1.403153 1.568372
C  -0.073981 1.449558 2.199178
C  -2.75231 1.677779 2.88083
C  -3.468043 1.23022 0.530051
C  -1.930405 -0.961263 -3.615329
C  -0.436416 1.733142 3.508304
C  -1.772473 1.84397 3.848796
C  -2.822392 -2.110663 -3.226079
C  -2.829093 -4.060956 -1.926419
H  5.560298 -0.790375 2.938925
H  5.939192 -2.030808 1.739592
H  7.16239 -0.862769 2.21821
H  6.316796 -1.37468 -0.703278
H  7.574467 -0.275527 -0.138123
H  6.291364 0.322216 -1.183525
H  7.048913 1.501927 1.58817
H  5.417048 1.6685 2.235292
H  5.762437 2.136889 0.570526
H  3.714865 -1.702297 1.960995
H  4.271337 1.386593 -0.960117
H  1.381672 -1.837837 1.379255
H  1.934872 1.253122 -1.5523
H  0.97331 1.379105 1.939473
H  -3.791074 1.763828 3.1666
H  -1.137081 -1.262978 -4.298457
H  -2.516026 -0.176027 -4.089104
H  0.331942 1.869086 4.256628
H  -2.061311 2.061283 4.867792
H  -3.630228 -1.747335 -2.57737
H  -3.292738 -2.509173 -4.134535
H  -3.437386 -4.630387 -2.63762
H  -2.154891 -4.75068 -1.420593
H  -3.500433 -3.621203 -1.180582
elementType: F O N C H
totalener: -1584.34442916 hartree
nucrepener: 3441.33608396 hartree
electener: -5025.68051313 hartree
oneelecener: -9014.48268588 hartree
twoeener: 3988.80217276 hartree
cpcmener: -0.04396914 hartree
kineticenergy: 1577.91140857 hartree
xcener: -146.961982879162 hartree
chargesum: 0.0000000
charge: -0.175011 -0.172032 -0.173997 -0.250737 -0.331720 -0.404692 -0.384247 -0.070376 0.332071 -0.110626 -0.359861 -0.328672 -0.330893 0.910227 -0.305196 -0.125597 -0.168056 -0.164236 -0.187288 0.266792 0.314893 0.046624 -0.437304 -0.242208 -0.141010 -0.068413 0.550260 0.008012 -0.139792 -0.145214 0.025453 -0.124107 0.103146 0.101920 0.101371 0.104065 0.097937 0.098703 0.098013 0.103184 0.098598 0.149375 0.148310 0.132891 0.150822 0.162514 0.151422 0.111647 0.121848 0.164082 0.167170 0.090731 0.105503 0.108137 0.118657 0.096907
qa: -0.1750 -0.1720 -0.1740 -0.2507 -0.3317 -0.4047 -0.3842 -0.0704 0.3321 -0.1106 -0.3599 -0.3287 -0.3309 0.9102 -0.3052 -0.1256 -0.1681 -0.1642 -0.1873 0.2668 0.3149 0.0466 -0.4373 -0.2422 -0.1410 -0.0684 0.5503 0.0080 -0.1398 -0.1452 0.0255 -0.1241 0.1031 0.1019 0.1014 0.1041 0.0979 0.0987 0.0980 0.1032 0.0986 0.1494 0.1483 0.1329 0.1508 0.1625 0.1514 0.1116 0.1218 0.1641 0.1672 0.0907 0.1055 0.1081 0.1187 0.0969
va: 1.1230 1.1363 1.1204 2.1782 2.1193 2.1028 1.9136 3.0857 3.6440 3.8052 3.9289 3.9175 3.9190 2.8935 3.6684 3.9383 4.0298 3.9610 4.0114 3.8238 4.3260 3.4936 4.0998 3.9128 3.9163 3.8717 4.4340 3.8381 3.9365 3.9098 3.9165 3.8868 1.0004 1.0007 1.0065 1.0032 1.0030 1.0038 1.0030 1.0036 1.0038 0.9969 1.0008 1.0210 1.0157 0.9917 1.0043 1.0212 1.0020 0.9902 0.9871 1.0003 1.0021 0.9919 0.9909 0.9922
dispcorr: -0.033202482 hartree
energy: -1584.377631644326
dipole: 52.09494 -51.58494 0.51000 -14.23248 15.06717 0.83469 3.04890 -1.53299 1.51592
magnitude: 1.80411 au
magnitude: 4.58568 debye
