program: Orca
programVersion: 5.0.2
elementType: F F F O O O O N C C C C C C C C C C C C C C C C C C C C C C C C H H H H H H H H H H H H H H H H H H H H H H H H
charge: 0
multiplicity: 1
keywords: wb97x-d3
keywords: def2-TZVPP
keywords: def2/J RIJCOSX
keywords: DEFGRID2
keywords: scfconv7
keywords: smallprint printgap noloewdin
keywords: NOSOSCF
formula: C24H24F3NO4
InChI: InChI=1/C24H24F3NO4/c1-22(2,3)16-9-11-17(12-10-16)23(15-28,21(30)32-14-13-31-4)20(29)18-7-5-6-8-19(18)24(25,26)27/h5-12H,13-14H2,1-4H3
56 atoms
F  -3.688847 1.468442 -0.493597
F  -4.745723 0.689522 1.199235
F  -3.327214 -0.549611 0.170439
O  -1.267986 -2.12202 -1.517707
O  -0.999614 0.840211 -1.176682
O  0.773037 -1.657846 -2.322669
O  -3.302157 -0.831178 -3.016356
N  -0.790087 -2.489882 1.775148
C  5.796342 0.51256 0.636178
C  4.332953 0.117044 0.486761
C  6.536373 0.169473 -0.662738
C  5.895738 2.020804 0.893888
C  6.479177 -0.217642 1.79033
C  0.158981 -0.937376 -0.092517
C  1.622271 -0.579941 0.126811
C  3.724993 -0.856253 1.272044
C  3.543722 0.733586 -0.488213
C  2.390047 -1.201641 1.098505
C  2.21552 0.397857 -0.670102
C  -0.705871 0.355295 -0.118002
C  -0.055668 -1.624031 -1.459377
C  -1.110807 0.953788 1.18764
C  -0.361286 -1.807929 0.954466
C  -2.458437 1.17654 1.503822
C  -0.12416 1.343253 2.085829
C  -2.787944 1.799566 2.697379
C  -3.557065 0.701745 0.594918
C  -1.760664 -2.624117 -2.775506
C  -0.464212 1.975715 3.27246
C  -1.793243 2.207452 3.575151
C  -2.245027 -1.502606 -3.657247
C  -3.688937 0.337706 -3.701293
H  7.589265 0.447504 -0.583046
H  6.48953 -0.900233 -0.874541
H  6.121578 0.698616 -1.521865
H  6.941737 2.315559 0.999023
H  5.377006 2.301473 1.812141
H  5.472903 2.608094 0.077965
H  6.006206 -0.001714 2.750085
H  7.519948 0.102313 1.860361
H  6.482096 -1.300038 1.650795
H  4.282148 -1.371523 2.041814
H  3.96937 1.495171 -1.129337
H  1.968195 -1.965289 1.739124
H  1.653804 0.914226 -1.437246
H  0.919119 1.181013 1.855392
H  -3.821083 1.969632 2.965138
H  -2.575417 -3.293403 -2.505801
H  -0.994884 -3.205333 -3.288354
H  0.315784 2.285262 3.95418
H  -2.06647 2.699537 4.498501
H  -1.424338 -0.81424 -3.896489
H  -2.570258 -1.948169 -4.60698
H  -2.883799 1.079582 -3.732903
H  -3.994753 0.126887 -4.731614
H  -4.539174 0.77098 -3.177263
elementType: F O N C H
totalener: -1584.34872084 hartree
nucrepener: 3445.90443867 hartree
electener: -5030.25315951 hartree
oneelecener: -9023.74900218 hartree
twoeener: 3993.49584267 hartree
cpcmener: -0.04493534 hartree
kineticenergy: 1577.89660445 hartree
xcener: -146.960399835831 hartree
chargesum: -0.0000000
charge: -0.176299 -0.173832 -0.180484 -0.259431 -0.338208 -0.404007 -0.392181 -0.061396 0.330682 -0.123728 -0.329712 -0.333108 -0.359512 0.851300 -0.226071 -0.117189 -0.172147 -0.165398 -0.202997 0.234669 0.339756 0.058162 -0.411581 -0.236838 -0.182714 -0.046770 0.551912 0.003658 -0.111954 -0.152081 0.009552 -0.122305 0.098192 0.103897 0.098937 0.098323 0.103141 0.099637 0.104499 0.101359 0.100678 0.149162 0.149191 0.133920 0.151704 0.162927 0.150551 0.118528 0.112442 0.164690 0.167846 0.100539 0.109134 0.097882 0.109280 0.113792
qa: -0.1763 -0.1738 -0.1805 -0.2594 -0.3382 -0.4040 -0.3922 -0.0614 0.3307 -0.1237 -0.3297 -0.3331 -0.3595 0.8513 -0.2261 -0.1172 -0.1721 -0.1654 -0.2030 0.2347 0.3398 0.0582 -0.4116 -0.2368 -0.1827 -0.0468 0.5519 0.0037 -0.1120 -0.1521 0.0096 -0.1223 0.0982 0.1039 0.0989 0.0983 0.1031 0.0996 0.1045 0.1014 0.1007 0.1492 0.1492 0.1339 0.1517 0.1629 0.1506 0.1185 0.1124 0.1647 0.1678 0.1005 0.1091 0.0979 0.1093 0.1138
va: 1.1225 1.1324 1.1149 2.1810 2.1018 2.0973 1.8868 3.1096 3.6478 3.8264 3.9179 3.9184 3.9270 3.1100 3.7345 3.9101 4.0265 4.0003 4.0071 3.7369 4.2580 3.4488 4.1682 3.9174 3.9344 3.8561 4.4307 3.8724 3.9232 3.9232 3.8952 3.8846 1.0030 1.0034 1.0036 1.0027 1.0035 1.0038 1.0003 1.0065 1.0006 0.9968 1.0003 1.0186 1.0175 0.9965 1.0056 1.0045 1.0146 0.9899 0.9874 1.0009 1.0021 0.9925 0.9935 0.9937
dispcorr: -0.033320465 hartree
energy: -1584.382041309192
dipole: 54.44216 -52.72955 1.71261 5.00355 -3.45006 1.55349 -6.33394 6.94104 0.60710
magnitude: 2.39059 au
magnitude: 6.07639 debye
