program: Orca
programVersion: 5.0.2
elementType: F F F O O O O N C C C C C C C C C C C C C C C C C C C C C C C C H H H H H H H H H H H H H H H H H H H H H H H H
charge: 0
multiplicity: 1
keywords: wb97x-d3
keywords: def2-TZVPP
keywords: def2/J RIJCOSX
keywords: DEFGRID2
keywords: scfconv7
keywords: smallprint printgap noloewdin
keywords: NOSOSCF
formula: C24H24F3NO4
InChI: InChI=1/C24H24F3NO4/c1-22(2,3)16-9-11-17(12-10-16)23(15-28,21(30)32-14-13-31-4)20(29)18-7-5-6-8-19(18)24(25,26)27/h5-12H,13-14H2,1-4H3
56 atoms
F  -3.388172 3.264022 -0.413395
F  -1.516655 2.232354 -0.471342
F  -2.065116 3.391492 1.263481
O  -1.164326 -0.932538 -0.922433
O  -0.370376 1.254315 2.055527
O  -0.887933 -2.945174 0.039167
O  0.428707 -0.698558 -3.219129
N  0.012106 -2.423079 3.306352
C  5.197308 0.106706 -1.081506
C  3.820577 -0.110261 -0.468348
C  5.568735 -1.131435 -1.90641
C  5.234718 1.325751 -2.000808
C  6.227217 0.30947 0.035328
C  -0.13027 -0.94622 1.159899
C  1.273492 -0.600703 0.65326
C  2.730611 0.707201 -0.752321
C  3.600887 -1.179246 0.40051
C  1.476551 0.46577 -0.212471
C  2.35391 -1.425085 0.950452
C  -0.950719 0.316669 1.585291
C  -0.79546 -1.74755 0.033436
C  -2.435042 0.267961 1.446475
C  -0.043242 -1.789123 2.348177
C  -3.185687 1.334037 0.924224
C  -3.100565 -0.858218 1.918677
C  -4.568803 1.246032 0.898052
C  -2.537725 2.556551 0.332899
C  -1.569408 -1.471139 -2.196568
C  -4.485278 -0.930101 1.90023
C  -5.219159 0.123474 1.391093
C  -0.366563 -1.843258 -3.024052
C  1.697864 -1.007742 -3.747238
H  6.547304 -0.997302 -2.371483
H  5.616493 -2.032846 -1.294124
H  4.841565 -1.305287 -2.702476
H  6.237249 1.439882 -2.415501
H  4.994223 2.249396 -1.471308
H  4.544729 1.227668 -2.841175
H  6.287158 -0.552895 0.700522
H  5.985348 1.1839 0.642169
H  7.220441 0.464993 -0.390735
H  2.835356 1.552235 -1.417862
H  4.411915 -1.848953 0.657487
H  0.674175 1.131281 -0.489642
H  2.242315 -2.276574 1.609174
H  -2.55577 -1.689475 2.344465
H  -5.164267 2.048204 0.48681
H  -2.140865 -0.671106 -2.663559
H  -2.224823 -2.332033 -2.065261
H  -4.978961 -1.811071 2.285765
H  -6.298808 0.077899 1.364094
H  0.206191 -2.641501 -2.534839
H  -0.730337 -2.251662 -3.976894
H  2.258071 -1.682266 -3.090173
H  1.628206 -1.476794 -4.735003
H  2.256969 -0.0783 -3.848259
elementType: F O N C H
totalener: -1584.34575451 hartree
nucrepener: 3483.48754658 hartree
electener: -5067.83330108 hartree
oneelecener: -9097.61014148 hartree
twoeener: 4029.77684040 hartree
cpcmener: -0.04482727 hartree
kineticenergy: 1577.88918752 hartree
xcener: -146.961079715415 hartree
chargesum: -0.0000000
charge: -0.175763 -0.173103 -0.172735 -0.250461 -0.322284 -0.409766 -0.392188 -0.057348 0.344178 -0.114934 -0.332591 -0.356518 -0.327250 0.707936 -0.061913 -0.163462 -0.154924 -0.258204 -0.219460 0.136838 0.262304 0.115444 -0.282814 -0.245963 -0.122137 -0.057363 0.550334 -0.003743 -0.143274 -0.135603 0.023880 -0.134526 0.100465 0.100001 0.097842 0.102448 0.103335 0.099074 0.098474 0.103385 0.098496 0.148583 0.145832 0.163964 0.140148 0.160532 0.151021 0.118511 0.114658 0.166126 0.168308 0.096800 0.109501 0.102029 0.115643 0.122236
qa: -0.1758 -0.1731 -0.1727 -0.2505 -0.3223 -0.4098 -0.3922 -0.0573 0.3442 -0.1149 -0.3326 -0.3565 -0.3272 0.7079 -0.0619 -0.1635 -0.1549 -0.2582 -0.2195 0.1368 0.2623 0.1154 -0.2828 -0.2460 -0.1221 -0.0574 0.5503 -0.0037 -0.1433 -0.1356 0.0239 -0.1345 0.1005 0.1000 0.0978 0.1024 0.1033 0.0991 0.0985 0.1034 0.0985 0.1486 0.1458 0.1640 0.1401 0.1605 0.1510 0.1185 0.1147 0.1661 0.1683 0.0968 0.1095 0.1020 0.1156 0.1222
va: 1.1282 1.1182 1.1202 2.1900 2.1419 2.0866 1.8944 3.1054 3.6152 3.7467 3.9219 3.9290 3.9150 3.1918 3.6510 3.8823 4.0058 3.9998 4.0732 3.9105 4.3688 3.3655 4.0922 3.9441 3.8720 3.8672 4.4131 3.8737 3.9608 3.9106 3.8931 3.8971 1.0047 1.0038 1.0067 1.0067 1.0009 1.0018 1.0036 1.0030 1.0031 0.9971 1.0021 1.0201 1.0111 0.9992 1.0054 1.0049 1.0133 0.9888 0.9867 0.9974 1.0022 0.9894 0.9935 0.9889
dispcorr: -0.035320921 hartree
energy: -1584.381075428568
dipole: 48.42380 -49.53278 -1.10897 -19.54389 18.86367 -0.68022 -26.80891 24.00931 -2.79961
magnitude: 3.08712 au
magnitude: 7.84683 debye
