program: Orca
programVersion: 5.0.2
elementType: F F F O O O O N C C C C C C C C C C C C C C C C C C C C C C C C H H H H H H H H H H H H H H H H H H H H H H H H
charge: 0
multiplicity: 1
keywords: wb97x-d3
keywords: def2-TZVPP
keywords: def2/J RIJCOSX
keywords: DEFGRID2
keywords: scfconv7
keywords: smallprint printgap noloewdin
keywords: NOSOSCF
formula: C24H24F3NO4
InChI: InChI=1/C24H24F3NO4/c1-22(2,3)16-9-11-17(12-10-16)23(15-28,21(30)32-14-13-31-4)20(29)18-7-5-6-8-19(18)24(25,26)27/h5-12H,13-14H2,1-4H3
56 atoms
F  -0.501858 0.874151 2.695557
F  -0.70901 2.996664 2.954983
F  0.779403 2.235486 1.616352
O  -0.757322 -3.372061 -0.19308
O  -3.0695 -0.799519 1.855888
O  -2.416106 -2.050054 -0.941375
O  0.437541 -2.866082 -2.678816
N  -0.445208 -2.588746 3.029515
C  3.685637 1.420159 -1.475278
C  2.473864 0.689201 -0.91503
C  3.377572 2.129363 -2.792382
C  4.145032 2.469733 -0.455079
C  4.812319 0.41075 -1.722628
C  -0.97975 -1.283401 0.836581
C  0.248851 -0.61876 0.226034
C  1.226589 0.711243 -1.531642
C  2.584527 -0.038324 0.270439
C  0.13317 0.061998 -0.980365
C  1.496554 -0.679938 0.835275
C  -2.181563 -0.348126 1.18617
C  -1.495057 -2.29111 -0.210431
C  -2.268073 1.012046 0.577175
C  -0.66355 -2.014397 2.057727
C  -1.467305 2.098197 0.926545
C  -3.22777 1.165831 -0.42012
C  -1.603565 3.304775 0.251742
C  -0.471915 2.047364 2.043724
C  -0.825695 -4.313047 -1.283329
C  -3.352523 2.368705 -1.094756
C  -2.531645 3.436225 -0.767281
C  0.418328 -4.156207 -2.116847
C  1.712644 -2.505627 -3.161974
H  2.598741 2.8864 -2.683585
H  4.274235 2.636805 -3.151499
H  3.064027 1.431455 -3.571097
H  3.358921 3.201552 -0.259209
H  5.015969 3.008756 -0.833643
H  4.426815 2.020094 0.498006
H  4.498294 -0.363048 -2.426515
H  5.13162 -0.082819 -0.803863
H  5.685148 0.913125 -2.144301
H  1.080447 1.239705 -2.463036
H  3.535293 -0.100042 0.784958
H  -0.808642 0.107491 -1.511155
H  1.636612 -1.21441 1.765936
H  -3.863441 0.333838 -0.690208
H  -0.986228 4.152495 0.51973
H  -1.734352 -4.167697 -1.866355
H  -0.854899 -5.305004 -0.836448
H  -4.092294 2.468803 -1.877268
H  -2.620348 4.376482 -1.293639
H  1.303884 -4.327719 -1.491664
H  0.41378 -4.935882 -2.889836
H  2.4604 -2.493847 -2.360542
H  2.063265 -3.188452 -3.943795
H  1.643313 -1.505324 -3.587169
elementType: F O N C H
totalener: -1584.34302504 hartree
nucrepener: 3587.88373100 hartree
electener: -5172.22675604 hartree
oneelecener: -9306.70885242 hartree
twoeener: 4134.48209638 hartree
cpcmener: -0.04435464 hartree
kineticenergy: 1577.91710975 hartree
xcener: -146.968926050569 hartree
chargesum: 0.0000000
charge: -0.175721 -0.174597 -0.168065 -0.266100 -0.344836 -0.411401 -0.387617 -0.059980 0.370284 -0.098652 -0.365863 -0.335242 -0.335072 0.758885 -0.204634 -0.186543 -0.165806 -0.274001 -0.149506 0.249054 0.347082 0.121029 -0.367740 -0.111239 -0.195229 -0.151225 0.562641 0.020653 -0.143849 -0.128763 0.030676 -0.132198 0.102494 0.101930 0.102948 0.100519 0.100017 0.100024 0.098466 0.099753 0.100228 0.146929 0.141528 0.154661 0.131402 0.150072 0.147384 0.109794 0.123274 0.166241 0.167631 0.090549 0.099165 0.102212 0.117179 0.119175
qa: -0.1757 -0.1746 -0.1681 -0.2661 -0.3448 -0.4114 -0.3876 -0.0600 0.3703 -0.0987 -0.3659 -0.3352 -0.3351 0.7589 -0.2046 -0.1865 -0.1658 -0.2740 -0.1495 0.2491 0.3471 0.1210 -0.3677 -0.1112 -0.1952 -0.1512 0.5626 0.0207 -0.1438 -0.1288 0.0307 -0.1322 0.1025 0.1019 0.1029 0.1005 0.1000 0.1000 0.0985 0.0998 0.1002 0.1469 0.1415 0.1547 0.1314 0.1501 0.1474 0.1098 0.1233 0.1662 0.1676 0.0905 0.0992 0.1022 0.1172 0.1192
va: 1.1247 1.1332 1.1252 2.1914 2.1230 2.0777 1.9123 3.1077 3.5813 3.7370 3.9345 3.9192 3.9227 3.3035 3.4008 3.8551 4.0107 3.9990 3.9742 3.9654 4.2625 3.4319 4.1684 3.7286 3.9636 3.9822 4.4088 3.8343 3.9333 3.8911 3.9201 3.8966 1.0008 1.0065 0.9996 1.0059 1.0038 1.0029 1.0051 1.0039 1.0035 0.9988 1.0042 1.0102 1.0172 1.0174 1.0065 1.0216 1.0009 0.9874 0.9861 0.9962 1.0016 0.9893 0.9917 0.9900
dispcorr: -0.037800103 hartree
energy: -1584.380825141203
dipole: 35.53976 -33.66940 1.87036 -4.62316 5.70311 1.07996 -41.34848 37.57550 -3.77298
magnitude: 4.34740 au
magnitude: 11.05022 debye
