program: Orca
programVersion: 5.0.2
elementType: F F F O O O O N C C C C C C C C C C C C C C C C C C C C C C C C H H H H H H H H H H H H H H H H H H H H H H H H
charge: 0
multiplicity: 1
keywords: wb97x-d3
keywords: def2-TZVPP
keywords: def2/J RIJCOSX
keywords: DEFGRID2
keywords: scfconv7
keywords: smallprint printgap noloewdin
keywords: NOSOSCF
formula: C24H24F3NO4
InChI: InChI=1/C24H24F3NO4/c1-22(2,3)16-9-11-17(12-10-16)23(15-28,21(30)32-14-13-31-4)20(29)18-7-5-6-8-19(18)24(25,26)27/h5-12H,13-14H2,1-4H3
56 atoms
F  -1.208237 3.38999 1.699655
F  -0.321106 1.476544 2.134106
F  -1.738548 2.343762 3.496159
O  0.03163 -2.406707 -1.694759
O  -0.527449 1.855173 -0.883872
O  -0.999098 -0.662076 -2.675284
O  -2.644894 -3.163477 -1.71556
N  -0.984606 -2.060087 1.463897
C  5.590548 0.71178 -0.131581
C  4.101057 0.408284 -0.228835
C  6.152485 1.270184 -1.437617
C  5.820584 1.748083 0.975031
C  6.347704 -0.576777 0.211524
C  -0.151247 -0.459168 -0.420712
C  1.34402 -0.177461 -0.338398
C  3.41878 -0.100825 0.877382
C  3.36235 0.614247 -1.390378
C  2.064791 -0.387458 0.830891
C  2.00555 0.331373 -1.448484
C  -0.973744 0.86098 -0.38776
C  -0.444728 -1.187203 -1.750478
C  -2.326103 0.832928 0.256167
C  -0.601687 -1.349568 0.644721
C  -2.574112 1.484604 1.467552
C  -3.366639 0.182169 -0.394641
C  -3.855388 1.490786 1.999155
C  -1.466157 2.177529 2.202466
C  -0.462902 -3.404157 -2.608146
C  -4.645888 0.197368 0.14019
C  -4.891351 0.853529 1.333469
C  -1.622817 -4.102085 -1.946669
C  -3.622183 -3.628413 -0.812774
H  6.047246 0.567295 -2.265947
H  5.671074 2.206621 -1.725043
H  7.217446 1.475038 -1.318939
H  5.289023 2.677588 0.763085
H  6.883617 1.983614 1.056004
H  5.490129 1.388767 1.950328
H  6.026654 -0.99944 1.164344
H  7.418334 -0.376526 0.285553
H  6.204631 -1.337852 -0.557624
H  3.946852 -0.283076 1.804888
H  3.834222 1.002063 -2.28201
H  1.587279 -0.785267 1.717268
H  1.484503 0.50612 -2.380765
H  -3.195403 -0.324783 -1.333255
H  -4.06056 1.988406 2.936693
H  0.355006 -4.103499 -2.766794
H  -0.731072 -2.959778 -3.566154
H  -5.447629 -0.305209 -0.383356
H  -5.886608 0.867661 1.755323
H  -1.958551 -4.918084 -2.599636
H  -1.28691 -4.554906 -1.005038
H  -4.355565 -2.835018 -0.674585
H  -4.140475 -4.515543 -1.192075
H  -3.190329 -3.876551 0.162617
elementType: F O N C H
totalener: -1584.34585161 hartree
nucrepener: 3439.62896130 hartree
electener: -5023.97481291 hartree
oneelecener: -9011.21169877 hartree
twoeener: 3987.23688586 hartree
cpcmener: -0.04186018 hartree
kineticenergy: 1577.90556462 hartree
xcener: -146.961601828368 hartree
chargesum: -0.0000000
charge: -0.172368 -0.174250 -0.171861 -0.270587 -0.326801 -0.396730 -0.378031 -0.065783 0.326093 -0.116154 -0.360344 -0.329708 -0.328574 0.763003 -0.111491 -0.163675 -0.154499 -0.193892 -0.211913 0.199808 0.294344 0.098258 -0.411719 -0.186070 -0.157601 -0.080703 0.542470 0.016693 -0.142123 -0.138567 0.016077 -0.113986 0.102339 0.103354 0.101555 0.103501 0.098258 0.098034 0.098611 0.097747 0.103328 0.145945 0.149600 0.137669 0.151394 0.170069 0.150374 0.124723 0.112824 0.166543 0.167048 0.106863 0.093830 0.107094 0.115139 0.094844
qa: -0.1724 -0.1743 -0.1719 -0.2706 -0.3268 -0.3967 -0.3780 -0.0658 0.3261 -0.1162 -0.3603 -0.3297 -0.3286 0.7630 -0.1115 -0.1637 -0.1545 -0.1939 -0.2119 0.1998 0.2943 0.0983 -0.4117 -0.1861 -0.1576 -0.0807 0.5425 0.0167 -0.1421 -0.1386 0.0161 -0.1140 0.1023 0.1034 0.1016 0.1035 0.0983 0.0980 0.0986 0.0977 0.1033 0.1459 0.1496 0.1377 0.1514 0.1701 0.1504 0.1247 0.1128 0.1665 0.1670 0.1069 0.0938 0.1071 0.1151 0.0948
va: 1.1239 1.1177 1.1359 2.1730 2.1392 2.0757 1.9211 3.0980 3.6441 3.7992 3.9273 3.9190 3.9184 3.2069 3.7138 4.0375 3.9198 3.9925 4.1095 3.8620 4.3173 3.4814 4.1208 3.8763 3.8761 3.8982 4.4395 3.8440 3.9481 3.9124 3.9146 3.8852 1.0004 1.0002 1.0063 1.0029 1.0032 1.0039 1.0037 1.0034 1.0031 1.0013 0.9971 1.0168 1.0159 1.0138 1.0051 1.0014 1.0174 0.9900 0.9870 1.0028 0.9961 0.9915 0.9929 0.9948
dispcorr: -0.033803956 hartree
energy: -1584.379655568163
dipole: 34.02740 -34.47188 -0.44449 -22.91677 20.66205 -2.25472 -17.11090 16.64339 -0.46751
magnitude: 2.34519 au
magnitude: 5.96099 debye
