program: Orca
programVersion: 5.0.2
elementType: F F F O O O O N C C C C C C C C C C C C C C C C C C C C C C C C H H H H H H H H H H H H H H H H H H H H H H H H
charge: 0
multiplicity: 1
keywords: wb97x-d3
keywords: def2-TZVPP
keywords: def2/J RIJCOSX
keywords: DEFGRID2
keywords: scfconv7
keywords: smallprint printgap noloewdin
keywords: NOSOSCF
formula: C24H24F3NO4
InChI: InChI=1/C24H24F3NO4/c1-22(2,3)16-9-11-17(12-10-16)23(15-28,21(30)32-14-13-31-4)20(29)18-7-5-6-8-19(18)24(25,26)27/h5-12H,13-14H2,1-4H3
56 atoms
F  -4.177975 2.359814 -0.030489
F  -5.292514 1.205707 1.390133
F  -3.851182 0.236346 0.123657
O  -0.516331 -0.419878 -2.328368
O  -1.43311 1.643594 -0.754568
O  -1.613681 -2.11971 -1.355537
O  1.172541 -2.4996 -3.075144
N  -1.349372 -2.043614 1.928702
C  5.318298 -0.325056 -0.100633
C  3.795833 -0.304731 -0.046447
C  5.871663 -0.901443 1.208383
C  5.758331 -1.210137 -1.273951
C  5.908715 1.070423 -0.296137
C  -0.556731 -0.450501 0.018571
C  0.974213 -0.352327 0.039784
C  3.042391 0.843982 -0.261577
C  3.093795 -1.484943 0.209972
C  1.652433 0.825683 -0.228769
C  1.713039 -1.513068 0.255343
C  -1.250527 0.929303 0.18902
C  -0.973912 -1.106029 -1.315456
C  -1.673755 1.31897 1.568671
C  -1.010647 -1.342144 1.085509
C  -3.016175 1.56958 1.86955
C  -0.706152 1.47511 2.553319
C  -3.366863 1.988289 3.143993
C  -4.087117 1.349274 0.839505
C  -0.557094 -0.985819 -3.648807
C  -1.063456 1.907947 3.820869
C  -2.390994 2.166594 4.114049
C  0.819502 -1.4943 -3.987574
C  2.521585 -2.880599 -3.185047
H  5.541573 -1.926137 1.384013
H  6.963349 -0.913204 1.183761
H  5.566574 -0.301764 2.068106
H  5.399107 -0.813929 -2.225973
H  5.390018 -2.233026 -1.17768
H  6.848421 -1.258022 -1.326619
H  5.635128 1.750186 0.513296
H  5.597047 1.524443 -1.238619
H  6.998252 1.009485 -0.313232
H  3.525555 1.789313 -0.466735
H  3.627887 -2.412293 0.375323
H  1.129065 1.753495 -0.41603
H  1.217634 -2.455925 0.454082
H  0.334033 1.272481 2.332114
H  -4.400122 2.176867 3.400639
H  -0.832655 -0.176935 -4.323875
H  -1.313496 -1.767621 -3.71845
H  -0.301029 2.036544 4.577229
H  -2.677176 2.498837 5.102657
H  0.802317 -1.865094 -5.02209
H  1.537862 -0.663193 -3.956961
H  2.747043 -3.319119 -4.164767
H  3.20079 -2.033689 -3.03207
H  2.725747 -3.630665 -2.421592
elementType: F O N C H
totalener: -1584.35597145 hartree
nucrepener: 3437.49456805 hartree
electener: -5021.85053951 hartree
oneelecener: -9006.08237825 hartree
twoeener: 3984.23183875 hartree
cpcmener: -0.04127470 hartree
kineticenergy: 1577.90447174 hartree
xcener: -146.960338662667 hartree
chargesum: 0.0000000
charge: -0.169963 -0.172590 -0.174990 -0.257109 -0.300797 -0.388772 -0.366774 -0.043589 0.352709 -0.082217 -0.326986 -0.359381 -0.358413 0.719115 -0.113689 -0.117941 -0.210447 -0.187130 -0.240460 0.124649 0.316239 0.064826 -0.324021 -0.209045 -0.161083 -0.067965 0.541819 0.006200 -0.124498 -0.143086 0.027238 -0.126266 0.098155 0.097860 0.103957 0.103861 0.101373 0.105876 0.104854 0.099882 0.101269 0.146122 0.144234 0.145565 0.142411 0.171193 0.147839 0.118861 0.108349 0.162128 0.163336 0.098095 0.088571 0.112949 0.091124 0.116555
qa: -0.1700 -0.1726 -0.1750 -0.2571 -0.3008 -0.3888 -0.3668 -0.0436 0.3527 -0.0822 -0.3270 -0.3594 -0.3584 0.7191 -0.1137 -0.1179 -0.2104 -0.1871 -0.2405 0.1246 0.3162 0.0648 -0.3240 -0.2090 -0.1611 -0.0680 0.5418 0.0062 -0.1245 -0.1431 0.0272 -0.1263 0.0982 0.0979 0.1040 0.1039 0.1014 0.1059 0.1049 0.0999 0.1013 0.1461 0.1442 0.1456 0.1424 0.1712 0.1478 0.1189 0.1083 0.1621 0.1633 0.0981 0.0886 0.1129 0.0911 0.1166
va: 1.1267 1.1333 1.1193 2.1933 2.1421 2.1145 1.9315 3.1158 3.6071 3.7338 3.9169 3.9323 3.9289 3.2429 3.7179 3.9005 3.9922 3.9997 4.0295 3.9346 4.3390 3.4523 4.0963 3.9204 3.9241 3.8848 4.4415 3.8548 3.9472 3.9149 3.9194 3.9071 1.0041 1.0035 1.0030 0.9996 1.0002 1.0075 1.0007 1.0001 1.0068 0.9981 1.0033 1.0142 1.0091 0.9865 1.0063 1.0006 1.0214 0.9905 0.9888 1.0019 0.9953 0.9916 0.9877 0.9903
dispcorr: -0.034306260 hartree
energy: -1584.390277712970
dipole: 73.81302 -70.37626 3.43676 -12.59004 14.18634 1.59630 -13.18325 12.90796 -0.27529
magnitude: 3.79938 au
magnitude: 9.65726 debye
