program: Orca
programVersion: 5.0.2
elementType: F F F O O O O N C C C C C C C C C C C C C C C C C C C C C C C C H H H H H H H H H H H H H H H H H H H H H H H H
charge: 0
multiplicity: 1
keywords: wb97x-d3
keywords: def2-TZVPP
keywords: def2/J RIJCOSX
keywords: DEFGRID2
keywords: scfconv7
keywords: smallprint printgap noloewdin
keywords: NOSOSCF
formula: C24H24F3NO4
InChI: InChI=1/C24H24F3NO4/c1-22(2,3)16-9-11-17(12-10-16)23(15-28,21(30)32-14-13-31-4)20(29)18-7-5-6-8-19(18)24(25,26)27/h5-12H,13-14H2,1-4H3
56 atoms
F  -3.786449 0.205551 0.19897
F  -4.115298 2.328685 0.060723
F  -5.200655 1.170891 1.502097
O  -0.80835 -0.462239 -2.358713
O  -1.337623 1.66161 -0.746503
O  -1.447886 -2.338255 -1.311415
O  1.211416 -2.175184 -3.16198
N  -1.527182 -1.993385 1.945319
C  5.268513 -0.317534 -0.098542
C  3.747589 -0.389026 -0.041036
C  5.724317 1.054981 0.412229
C  5.931211 -1.394829 0.757157
C  5.731502 -0.499193 -1.549482
C  -0.613423 -0.515263 -0.002462
C  0.923163 -0.447373 0.01888
C  2.980112 0.518217 -0.775407
C  3.057418 -1.32419 0.721985
C  1.597818 0.495793 -0.753478
C  1.668519 -1.356499 0.754099
C  -1.209335 0.90894 0.175266
C  -1.024898 -1.21607 -1.314213
C  -1.580842 1.299971 1.571852
C  -1.121495 -1.358121 1.079297
C  -2.912138 1.528521 1.928277
C  -0.57661 1.455909 2.51822
C  -3.220477 1.918822 3.222568
C  -4.008344 1.315784 0.925998
C  -0.807633 -1.052978 -3.669611
C  -0.89164 1.856068 3.80807
C  -2.210602 2.087081 4.158766
C  0.620992 -1.296896 -4.08174
C  2.597164 -2.316051 -3.351489
H  5.401564 1.223217 1.441553
H  6.814029 1.124897 0.390228
H  5.333976 1.872318 -0.19617
H  5.670889 -1.301943 1.813327
H  7.01649 -1.306135 0.683547
H  5.66648 -2.402604 0.431198
H  5.323009 0.264789 -2.212529
H  5.438395 -1.474986 -1.942096
H  6.820018 -0.431869 -1.610024
H  3.463954 1.269461 -1.387209
H  3.589755 -2.055494 1.314281
H  1.065437 1.224428 -1.348281
H  1.187311 -2.110338 1.363668
H  0.456225 1.273961 2.250492
H  -4.24599 2.089151 3.519958
H  -1.269354 -0.324948 -4.334904
H  -1.402573 -1.965824 -3.688679
H  -0.102543 1.9803 4.537407
H  -2.462619 2.390557 5.165843
H  0.617946 -1.707596 -5.101423
H  1.164185 -0.342499 -4.122697
H  2.836154 -2.787104 -4.31261
H  3.116616 -1.351569 -3.311937
H  2.980544 -2.951693 -2.553863
elementType: F O N C H
totalener: -1584.35501181 hartree
nucrepener: 3452.95304473 hartree
electener: -5037.30805654 hartree
oneelecener: -9037.02215677 hartree
twoeener: 3999.71410023 hartree
cpcmener: -0.04020759 hartree
kineticenergy: 1577.90478579 hartree
xcener: -146.961827314267 hartree
chargesum: 0.0000000
charge: -0.176391 -0.169814 -0.171501 -0.256281 -0.307200 -0.393429 -0.365328 -0.036192 0.364027 -0.079482 -0.326572 -0.361648 -0.355430 0.780615 -0.289956 -0.220723 -0.153759 -0.183889 -0.108962 0.179799 0.359905 0.035525 -0.378157 -0.199305 -0.148669 -0.078052 0.547262 0.005390 -0.127271 -0.137717 0.012601 -0.123141 0.104074 0.097734 0.098085 0.102096 0.100493 0.103313 0.102993 0.099771 0.104813 0.140539 0.144894 0.147865 0.135607 0.161750 0.148507 0.117887 0.110675 0.162196 0.163305 0.108035 0.093997 0.112571 0.087093 0.115452
qa: -0.1764 -0.1698 -0.1715 -0.2563 -0.3072 -0.3934 -0.3653 -0.0362 0.3640 -0.0795 -0.3266 -0.3616 -0.3554 0.7806 -0.2900 -0.2207 -0.1538 -0.1839 -0.1090 0.1798 0.3599 0.0355 -0.3782 -0.1993 -0.1487 -0.0781 0.5473 0.0054 -0.1273 -0.1377 0.0126 -0.1231 0.1041 0.0977 0.0981 0.1021 0.1005 0.1033 0.1030 0.0998 0.1048 0.1405 0.1449 0.1479 0.1356 0.1618 0.1485 0.1179 0.1107 0.1622 0.1633 0.1080 0.0940 0.1126 0.0871 0.1155
va: 1.1170 1.1280 1.1359 2.2009 2.1417 2.1096 1.9268 3.1110 3.5954 3.7290 3.9175 3.9301 3.9283 3.1573 3.7856 4.0242 3.9315 3.9601 3.9733 3.9057 4.2993 3.5156 4.1101 3.9035 3.9087 3.9003 4.4374 3.8546 3.9383 3.9093 3.9136 3.9051 1.0034 1.0035 1.0037 1.0006 1.0070 0.9999 0.9999 1.0035 1.0072 1.0065 0.9999 1.0233 1.0150 0.9914 1.0060 1.0018 1.0203 0.9903 0.9886 1.0027 0.9940 0.9919 0.9879 0.9906
dispcorr: -0.034859978 hartree
energy: -1584.389871789789
dipole: 72.90675 -69.64281 3.26394 -10.50528 12.16834 1.66306 -14.26972 13.84088 -0.42884
magnitude: 3.68823 au
magnitude: 9.37473 debye
