program: Orca
programVersion: 5.0.2
elementType: F F F O O O O N C C C C C C C C C C C C C C C C C C C C C C C C H H H H H H H H H H H H H H H H H H H H H H H H
charge: 0
multiplicity: 1
keywords: wb97x-d3
keywords: def2-TZVPP
keywords: def2/J RIJCOSX
keywords: DEFGRID2
keywords: scfconv7
keywords: smallprint printgap noloewdin
keywords: NOSOSCF
formula: C24H24F3NO4
InChI: InChI=1/C24H24F3NO4/c1-22(2,3)16-9-11-17(12-10-16)23(15-28,21(30)32-14-13-31-4)20(29)18-7-5-6-8-19(18)24(25,26)27/h5-12H,13-14H2,1-4H3
56 atoms
F  -4.494687 1.982902 0.205159
F  -5.139072 0.735192 1.828286
F  -3.785809 -0.041413 0.348872
O  -0.694569 -0.590621 -2.419101
O  -1.627131 1.526892 -0.953976
O  -1.479159 -2.381579 -1.318245
O  1.304057 -2.43637 -2.930747
N  -1.534878 -1.916145 1.947343
C  5.204462 -0.187909 -0.090817
C  3.681534 -0.215719 -0.06795
C  5.723172 0.040499 1.333923
C  5.726202 -1.532534 -0.61425
C  5.748926 0.918817 -0.991759
C  -0.666005 -0.502735 -0.067783
C  0.86219 -0.358423 -0.014272
C  2.894001 0.702951 -0.755589
C  3.01461 -1.201666 0.660126
C  1.507465 0.636249 -0.736471
C  1.633561 -1.278338 0.687969
C  -1.348806 0.889722 0.020229
C  -1.012483 -1.277549 -1.353405
C  -1.615805 1.40006 1.402766
C  -1.150327 -1.305221 1.054666
C  -2.917997 1.505459 1.896338
C  -0.545035 1.799208 2.1916
C  -3.132212 2.018371 3.167138
C  -4.087729 1.050693 1.073127
C  -0.599186 -1.254105 -3.689839
C  -0.768005 2.317896 3.458452
C  -2.059111 2.427284 3.944671
C  0.849929 -1.580386 -3.944024
C  2.700156 -2.600243 -2.932774
H  5.398959 -0.743691 2.019787
H  6.815341 0.051406 1.344256
H  5.377421 0.995753 1.734179
H  5.380958 -1.723887 -1.632309
H  5.409868 -2.371319 0.007305
H  6.818134 -1.533862 -0.629526
H  5.448964 1.913404 -0.656112
H  5.427082 0.800725 -2.028635
H  6.839953 0.892604 -0.986839
H  3.348883 1.495019 -1.333767
H  3.575377 -1.939896 1.219525
H  0.953748 1.3742 -1.30073
H  1.171934 -2.073282 1.259443
H  0.466875 1.717453 1.818081
H  -4.132741 2.099167 3.568976
H  -0.958701 -0.544919 -4.433594
H  -1.234705 -2.139245 -3.720244
H  0.07226 2.630947 4.063264
H  -2.237792 2.824379 4.93464
H  0.929924 -2.040031 -4.93903
H  1.438026 -0.652652 -3.970665
H  3.056163 -3.096317 -3.843471
H  3.223874 -1.641477 -2.844975
H  2.964679 -3.223182 -2.079133
elementType: F O N C H
totalener: -1584.35503695 hartree
nucrepener: 3463.32041052 hartree
electener: -5047.67544747 hartree
oneelecener: -9057.62061315 hartree
twoeener: 4009.94516568 hartree
cpcmener: -0.04067645 hartree
kineticenergy: 1577.92103703 hartree
xcener: -146.965415015870 hartree
chargesum: -0.0000000
charge: -0.170771 -0.171327 -0.175364 -0.257274 -0.302660 -0.391011 -0.366518 -0.039156 0.363716 -0.119099 -0.322023 -0.350232 -0.362978 0.793800 -0.296585 -0.142679 -0.184353 -0.154461 -0.149861 0.179967 0.350577 0.032884 -0.359004 -0.195034 -0.162109 -0.074434 0.546616 0.007756 -0.126041 -0.146540 0.011519 -0.122391 0.098373 0.097717 0.102641 0.101283 0.103174 0.102596 0.101065 0.103691 0.101205 0.144836 0.139451 0.143760 0.137154 0.160622 0.147476 0.117586 0.110565 0.162458 0.163731 0.106981 0.091833 0.113065 0.083425 0.120382
qa: -0.1708 -0.1713 -0.1754 -0.2573 -0.3027 -0.3910 -0.3665 -0.0392 0.3637 -0.1191 -0.3220 -0.3502 -0.3630 0.7938 -0.2966 -0.1427 -0.1844 -0.1545 -0.1499 0.1800 0.3506 0.0329 -0.3590 -0.1950 -0.1621 -0.0744 0.5466 0.0078 -0.1260 -0.1465 0.0115 -0.1224 0.0984 0.0977 0.1026 0.1013 0.1032 0.1026 0.1011 0.1037 0.1012 0.1448 0.1395 0.1438 0.1372 0.1606 0.1475 0.1176 0.1106 0.1625 0.1637 0.1070 0.0918 0.1131 0.0834 0.1204
va: 1.1262 1.1357 1.1179 2.1966 2.1490 2.1103 1.9296 3.1105 3.5948 3.7344 3.9140 3.9276 3.9329 3.1067 3.7511 3.8851 4.0110 3.9280 3.9908 3.9680 4.3078 3.5394 4.0801 3.8765 3.9224 3.9102 4.4358 3.8517 3.9413 3.9145 3.9180 3.9075 1.0036 1.0035 1.0039 1.0027 1.0024 1.0062 1.0008 0.9993 1.0068 0.9991 1.0060 1.0222 1.0118 0.9955 1.0063 1.0017 1.0197 0.9902 0.9885 1.0035 0.9932 0.9919 0.9920 0.9890
dispcorr: -0.035474900 hartree
energy: -1584.390511848093
dipole: 74.52604 -70.88102 3.64503 -8.33587 10.19158 1.85571 -14.22303 13.73145 -0.49158
magnitude: 4.11965 au
magnitude: 10.47132 debye
