program: Orca
programVersion: 5.0.2
elementType: F F F O O O O N C C C C C C C C C C C C C C C C C C C C C C C C H H H H H H H H H H H H H H H H H H H H H H H H
charge: 0
multiplicity: 1
keywords: wb97x-d3
keywords: def2-TZVPP
keywords: def2/J RIJCOSX
keywords: DEFGRID2
keywords: scfconv7
keywords: smallprint printgap noloewdin
keywords: NOSOSCF
formula: C24H24F3NO4
InChI: InChI=1/C24H24F3NO4/c1-22(2,3)16-9-11-17(12-10-16)23(15-28,21(30)32-14-13-31-4)20(29)18-7-5-6-8-19(18)24(25,26)27/h5-12H,13-14H2,1-4H3
56 atoms
F  -2.648639 3.80051 -0.149734
F  -0.832825 2.674628 -0.234218
F  -1.550583 3.427713 1.654052
O  -0.369536 -2.539881 -1.104609
O  -0.031729 1.002165 1.919802
O  -0.885989 -0.404064 -1.580704
O  -3.225061 -2.658629 -1.60946
N  -0.046378 -2.91794 2.1747
C  5.740059 0.650887 -0.363098
C  4.283344 0.255012 -0.155131
C  6.472582 -0.491544 -1.076863
C  5.880051 1.916762 -1.206539
C  6.394619 0.904828 1.000126
C  0.141571 -0.916105 0.514307
C  1.604308 -0.524898 0.288383
C  3.21933 0.961516 -0.710364
C  3.966095 -0.860837 0.6187
C  1.903649 0.581091 -0.498093
C  2.65416 -1.246568 0.841599
C  -0.635759 0.26112 1.199132
C  -0.462916 -1.25848 -0.852358
C  -2.10623 0.381044 0.978064
C  0.046269 -2.05244 1.424682
C  -2.722988 1.611573 0.706694
C  -2.896199 -0.753565 1.118122
C  -4.10415 1.675297 0.599794
C  -1.934597 2.875844 0.498564
C  -0.922836 -3.071961 -2.322666
C  -4.27748 -0.677434 1.025842
C  -4.881576 0.538353 0.770052
C  -2.306744 -3.622497 -2.052183
C  -3.768327 -1.858285 -2.633091
H  7.519109 -0.227123 -1.243635
H  6.458124 -1.415332 -0.496352
H  6.025061 -0.703097 -2.050043
H  6.936394 2.164928 -1.323103
H  5.395048 2.777878 -0.742539
H  5.465244 1.795224 -2.209093
H  7.43963 1.194916 0.870715
H  6.379896 0.019735 1.637828
H  5.89152 1.710314 1.538838
H  3.396168 1.834444 -1.323035
H  4.752326 -1.452445 1.070746
H  1.120725 1.16822 -0.956442
H  2.472722 -2.117928 1.45719
H  -2.451409 -1.715379 1.334111
H  -4.59781 2.611624 0.380785
H  -0.261086 -3.886178 -2.615723
H  -0.907923 -2.32132 -3.113241
H  -4.871517 -1.571866 1.154345
H  -5.957854 0.611257 0.691514
H  -2.648935 -4.125112 -2.967061
H  -2.243977 -4.384284 -1.271154
H  -4.310897 -2.461205 -3.37067
H  -4.47361 -1.16715 -2.171322
H  -3.017681 -1.266275 -3.16544
elementType: F O N C H
totalener: -1584.35675014 hartree
nucrepener: 3433.43140855 hartree
electener: -5017.78815869 hartree
oneelecener: -8998.29565822 hartree
twoeener: 3980.50749953 hartree
cpcmener: -0.03560196 hartree
kineticenergy: 1577.89575586 hartree
xcener: -146.960453171272 hartree
chargesum: 0.0000000
charge: -0.177286 -0.172110 -0.170877 -0.261636 -0.309283 -0.399235 -0.372314 -0.054824 0.315983 -0.099380 -0.326035 -0.357301 -0.326102 0.885525 -0.246003 -0.159908 -0.164562 -0.165275 -0.180456 0.150685 0.262995 0.122054 -0.360139 -0.231479 -0.134817 -0.051618 0.538293 -0.016590 -0.165984 -0.132093 0.032654 -0.107139 0.097175 0.097320 0.103257 0.100379 0.102948 0.100453 0.096907 0.097154 0.104100 0.146573 0.140967 0.145716 0.138019 0.154179 0.147873 0.123084 0.115080 0.159801 0.163720 0.094272 0.099338 0.106345 0.106193 0.093407
qa: -0.1773 -0.1721 -0.1709 -0.2616 -0.3093 -0.3992 -0.3723 -0.0548 0.3160 -0.0994 -0.3260 -0.3573 -0.3261 0.8855 -0.2460 -0.1599 -0.1646 -0.1653 -0.1805 0.1507 0.2630 0.1221 -0.3601 -0.2315 -0.1348 -0.0516 0.5383 -0.0166 -0.1660 -0.1321 0.0327 -0.1071 0.0972 0.0973 0.1033 0.1004 0.1029 0.1005 0.0969 0.0972 0.1041 0.1466 0.1410 0.1457 0.1380 0.1542 0.1479 0.1231 0.1151 0.1598 0.1637 0.0943 0.0993 0.1063 0.1062 0.0934
va: 1.1243 1.1221 1.1219 2.1723 2.1560 2.0878 1.9247 3.1054 3.6596 3.7921 3.9194 3.9280 3.9191 3.0210 3.7419 3.9833 4.0492 4.0309 4.0158 3.8926 4.3224 3.3803 4.1280 3.9570 3.8435 3.8682 4.4396 3.8244 3.9377 3.8906 3.9199 3.8912 1.0034 1.0040 1.0032 1.0068 1.0007 1.0007 1.0034 1.0042 1.0029 0.9980 1.0044 1.0307 1.0139 1.0062 1.0066 1.0069 1.0054 0.9943 0.9879 1.0043 1.0012 0.9962 0.9901 0.9896
dispcorr: -0.033702999 hartree
energy: -1584.390453139983
dipole: 35.99336 -36.83825 -0.84490 -21.56009 20.11140 -1.44869 -18.65513 16.15255 -2.50257
magnitude: 3.01254 au
magnitude: 7.65727 debye
