program: Orca
programVersion: 5.0.2
elementType: F F F O O O O N C C C C C C C C C C C C C C C C C C C C C C C C H H H H H H H H H H H H H H H H H H H H H H H H
charge: 0
multiplicity: 1
keywords: wb97x-d3
keywords: def2-TZVPP
keywords: def2/J RIJCOSX
keywords: DEFGRID2
keywords: scfconv7
keywords: smallprint printgap noloewdin
keywords: NOSOSCF
formula: C24H24F3NO4
InChI: InChI=1/C24H24F3NO4/c1-22(2,3)16-9-11-17(12-10-16)23(15-28,21(30)32-14-13-31-4)20(29)18-7-5-6-8-19(18)24(25,26)27/h5-12H,13-14H2,1-4H3
56 atoms
F  -4.672978 1.707009 0.794612
F  -3.375523 0.419875 -0.325537
F  -3.244848 2.56395 -0.552731
O  -1.31782 -1.661589 -1.563717
O  -0.732433 1.252816 -1.039719
O  0.7950 -1.458228 -2.266675
O  -3.77447 -3.11674 -3.794339
N  -0.863196 -2.334922 1.704179
C  5.910184 0.28576 0.791049
C  4.42248 0.009207 0.608602
C  6.506765 -0.503087 1.955323
C  6.651782 -0.106753 -0.493173
C  6.121759 1.780093 1.063065
C  0.180998 -0.702647 -0.041588
C  1.665591 -0.459456 0.203388
C  3.701021 0.688887 -0.376931
C  3.72216 -0.910498 1.380698
C  2.351805 0.466512 -0.58007
C  2.367084 -1.145006 1.182989
C  -0.596055 0.64811 -0.01202
C  -0.057804 -1.320504 -1.440219
C  -1.106158 1.146017 1.296533
C  -0.395254 -1.614798 0.941285
C  -2.413235 1.632522 1.452292
C  -0.23572 1.177505 2.380786
C  -2.808935 2.145379 2.678256
C  -3.4232 1.582877 0.338227
C  -1.747294 -2.240292 -2.807982
C  -0.637685 1.704163 3.598178
C  -1.923549 2.189786 3.745616
C  -3.247548 -2.45072 -2.67699
C  -3.910502 -2.311459 -4.943079
H  7.567901 -0.267493 2.053197
H  6.031244 -0.256683 2.906844
H  6.429219 -1.581935 1.808331
H  6.298583 0.455569 -1.35904
H  6.529719 -1.168948 -0.714232
H  7.721248 0.089812 -0.390056
H  5.596294 2.099062 1.965226
H  5.775238 2.404367 0.238286
H  7.18358 1.992318 1.205042
H  4.19643 1.4141 -1.010401
H  4.220161 -1.471065 2.159506
H  1.849971 1.026671 -1.357763
H  1.875906 -1.873695 1.815323
H  0.777379 0.813895 2.277967
H  -3.814869 2.51272 2.823742
H  -1.234043 -3.190822 -2.968191
H  -1.498316 -1.562594 -3.626795
H  0.058168 1.731204 4.425638
H  -2.251225 2.596949 4.692507
H  -3.451378 -3.079342 -1.806929
H  -3.747679 -1.486598 -2.515723
H  -4.47752 -2.881187 -5.679278
H  -4.458274 -1.385826 -4.730809
H  -2.950466 -2.041787 -5.395868
elementType: F O N C H
totalener: -1584.35717844 hartree
nucrepener: 3350.91927213 hartree
electener: -4935.27645057 hartree
oneelecener: -8831.85628521 hartree
twoeener: 3896.57983464 hartree
cpcmener: -0.03514526 hartree
kineticenergy: 1577.86813375 hartree
xcener: -146.953426851345 hartree
chargesum: 0.0000000
charge: -0.176603 -0.176339 -0.171702 -0.264102 -0.325648 -0.381427 -0.383011 -0.048701 0.316317 -0.115019 -0.356701 -0.325147 -0.327562 0.843338 -0.200105 -0.181393 -0.113110 -0.181825 -0.189453 0.206011 0.316916 0.097666 -0.416091 -0.240459 -0.211943 -0.042514 0.537744 -0.003807 -0.107789 -0.150028 0.027102 -0.108041 0.100267 0.103640 0.100595 0.098112 0.103766 0.097258 0.103202 0.097897 0.097117 0.144000 0.146227 0.149193 0.136030 0.183657 0.147626 0.111389 0.114356 0.161861 0.164018 0.107228 0.081369 0.116470 0.092840 0.095310
qa: -0.1766 -0.1763 -0.1717 -0.2641 -0.3256 -0.3814 -0.3830 -0.0487 0.3163 -0.1150 -0.3567 -0.3251 -0.3276 0.8433 -0.2001 -0.1814 -0.1131 -0.1818 -0.1895 0.2060 0.3169 0.0977 -0.4161 -0.2405 -0.2119 -0.0425 0.5377 -0.0038 -0.1078 -0.1500 0.0271 -0.1080 0.1003 0.1036 0.1006 0.0981 0.1038 0.0973 0.1032 0.0979 0.0971 0.1440 0.1462 0.1492 0.1360 0.1837 0.1476 0.1114 0.1144 0.1619 0.1640 0.1072 0.0814 0.1165 0.0928 0.0953
va: 1.1260 1.1265 1.1231 2.1800 2.1262 2.1308 1.9380 3.1104 3.6670 3.8184 3.9265 3.9191 3.9188 3.1646 3.7578 4.0464 3.9112 4.0375 4.0024 3.8063 4.2559 3.4354 4.1949 3.9442 3.9299 3.8507 4.4389 3.8086 3.9279 3.9341 3.9642 3.9058 1.0070 1.0005 1.0008 1.0040 1.0036 1.0031 1.0033 1.0044 1.0033 1.0017 0.9977 1.0184 1.0203 0.9816 1.0074 1.0022 0.9970 0.9908 0.9889 0.9946 1.0097 0.9912 0.9920 0.9807
dispcorr: -0.030949713 hartree
energy: -1584.388128158135
dipole: 52.28088 -50.95341 1.32747 -8.86706 10.31165 1.44458 -3.18249 4.59573 1.41324
magnitude: 2.41790 au
magnitude: 6.14581 debye
