program: Orca
programVersion: 5.0.2
elementType: F F F O O O O N C C C C C C C C C C C C C C C C C C C C C C C C H H H H H H H H H H H H H H H H H H H H H H H H
charge: 0
multiplicity: 1
keywords: wb97x-d3
keywords: def2-TZVPP
keywords: def2/J RIJCOSX
keywords: DEFGRID2
keywords: scfconv7
keywords: smallprint printgap noloewdin
keywords: NOSOSCF
formula: C24H24F3NO4
InChI: InChI=1/C24H24F3NO4/c1-22(2,3)16-9-11-17(12-10-16)23(15-28,21(30)32-14-13-31-4)20(29)18-7-5-6-8-19(18)24(25,26)27/h5-12H,13-14H2,1-4H3
56 atoms
F  -3.379735 2.286576 -0.342142
F  -4.665409 1.394761 1.120457
F  -3.376667 0.149001 -0.058106
O  -1.331198 -1.573024 -1.689348
O  -0.80976 1.270866 -0.996033
O  0.777687 -1.32956 -2.394776
O  -3.857845 -2.79196 -3.979838
N  -0.832972 -2.438016 1.543794
C  5.898418 0.30463 0.729038
C  4.4148 0.01511 0.537003
C  6.084864 1.766774 1.152189
C  6.528731 -0.587633 1.797048
C  6.628044 0.062838 -0.598291
C  0.179407 -0.708738 -0.124826
C  1.663612 -0.468803 0.12071
C  3.743877 -0.991831 1.222081
C  3.667719 0.7722 -0.369638
C  2.390572 -1.232711 1.020219
C  2.32105 0.541435 -0.578594
C  -0.60433 0.629703 -0.002915
C  -0.069467 -1.242176 -1.55596
C  -1.039798 1.071594 1.353602
C  -0.384886 -1.672471 0.814049
C  -2.364349 1.447423 1.622106
C  -0.089298 1.155685 2.365051
C  -2.701114 1.904862 2.886907
C  -3.445483 1.324164 0.583005
C  -1.784149 -2.056485 -2.964867
C  -0.433409 1.630477 3.6212
C  -1.738029 2.006119 3.880921
C  -3.294896 -2.192435 -2.843141
C  -3.936209 -1.948712 -5.106773
H  5.576538 1.976961 2.09533
H  7.14546 1.986908 1.29134
H  5.70446 2.466479 0.406722
H  6.470244 -1.647029 1.540182
H  6.064323 -0.450693 2.775644
H  7.586415 -0.340625 1.903721
H  6.521952 -0.972899 -0.926841
H  7.695006 0.268826 -0.488407
H  6.252457 0.704393 -1.397042
H  4.26399 -1.615144 1.936105
H  4.141009 1.564956 -0.935385
H  1.920276 -2.028196 1.584259
H  1.79662 1.16112 -1.294032
H  0.937245 0.877342 2.171828
H  -3.718545 2.185764 3.119036
H  -1.320813 -3.022479 -3.176929
H  -1.497004 -1.348514 -3.744574
H  0.322589 1.700865 4.3915
H  -2.019206 2.369241 4.860131
H  -3.533099 -2.837879 -1.994376
H  -3.741606 -1.208248 -2.649448
H  -4.417522 -0.992615 -4.869742
H  -2.958967 -1.735898 -5.553024
H  -4.541555 -2.457236 -5.857171
elementType: F O N C H
totalener: -1584.35703023 hartree
nucrepener: 3359.16352435 hartree
electener: -4943.52055458 hartree
oneelecener: -8848.34070970 hartree
twoeener: 3904.82015513 hartree
cpcmener: -0.03515187 hartree
kineticenergy: 1577.87841953 hartree
xcener: -146.954777698609 hartree
chargesum: -0.0000000
charge: -0.172125 -0.175318 -0.176381 -0.262891 -0.321328 -0.381034 -0.382795 -0.050535 0.318460 -0.114651 -0.327400 -0.357474 -0.325270 0.845724 -0.224374 -0.117335 -0.175739 -0.170998 -0.179177 0.202985 0.316703 0.077583 -0.410990 -0.240611 -0.187003 -0.047252 0.543823 -0.003344 -0.111767 -0.146367 0.025771 -0.109413 0.102674 0.097307 0.097821 0.100920 0.103549 0.100129 0.104112 0.097142 0.097895 0.146493 0.143872 0.133188 0.150062 0.172005 0.147814 0.113018 0.113007 0.161155 0.163847 0.107762 0.081144 0.093281 0.095826 0.116504
qa: -0.1721 -0.1753 -0.1764 -0.2629 -0.3213 -0.3810 -0.3828 -0.0505 0.3185 -0.1147 -0.3274 -0.3575 -0.3253 0.8457 -0.2244 -0.1173 -0.1757 -0.1710 -0.1792 0.2030 0.3167 0.0776 -0.4110 -0.2406 -0.1870 -0.0473 0.5438 -0.0033 -0.1118 -0.1464 0.0258 -0.1094 0.1027 0.0973 0.0978 0.1009 0.1035 0.1001 0.1041 0.0971 0.0979 0.1465 0.1439 0.1332 0.1501 0.1720 0.1478 0.1130 0.1130 0.1612 0.1638 0.1078 0.0811 0.0933 0.0958 0.1165
va: 1.1242 1.1284 1.1249 2.1800 2.1263 2.1310 1.9389 3.1103 3.6655 3.8193 3.9191 3.9273 3.9189 3.1402 3.7615 3.9142 4.0386 4.0041 4.0159 3.7956 4.2626 3.4353 4.1834 3.9360 3.9268 3.8574 4.4350 3.8057 3.9288 3.9262 3.9634 3.9056 1.0036 1.0032 1.0043 1.0007 1.0004 1.0071 1.0036 1.0031 1.0041 0.9977 1.0020 1.0203 1.0167 0.9899 1.0071 1.0015 0.9977 0.9912 0.9889 0.9945 1.0090 0.9917 0.9807 0.9912
dispcorr: -0.031271756 hartree
energy: -1584.388301984665
dipole: 52.71457 -51.20294 1.51162 -6.05191 7.56264 1.51073 -5.32123 6.71410 1.39286
magnitude: 2.55095 au
magnitude: 6.48401 debye
