program: Gaussian 09
title: 000054526
version: EM64L-G09RevD.01
frameworkgroup: C1[X(C21H34N2O3)]
method: RPBEPBE
basis: SDD
operation: Freq
keyword: #p
keyword: freq=noraman
keyword: PBEPBE/SDD
title: #p freq=noraman PBEPBE/SDD
converged: YES YES NO NO
title: Mulliken charges:
elementType: O O O N N C C C C C C C C C C C C C C C C C C C C C H H H H H H H H H H H H H H H H H H H H H H H H H H H H H H H H H H
charge: -0.296658 -0.324299 -0.284549 -0.070978 -0.467766 -0.360054 -0.352142 -0.382704 -0.401013 -0.402358 -0.402170 -0.354597 -0.252302 -0.403474 -0.335017 0.233329 -0.258015 -0.344253 0.299903 0.267133 -0.394343 -0.697004 -0.416287 -0.346421 -0.256696 -0.227621 0.206849 0.164662 0.193574 0.182767 0.213726 0.186713 0.192304 0.220427 0.201791 0.191408 0.198587 0.203113 0.215581 0.185138 0.216505 0.229537 0.233286 0.187354 0.223867 0.172366 0.191120 0.200393 0.201005 0.183734 0.210616 0.217695 0.392852 0.213672 0.214627 0.207354 0.227876 0.296441 0.226908 0.226507
chargesum: 0.00000
title: Mulliken charges with hydrogens summed into heavy atoms:
elementType: O O O N N C C C C C C C C C C C C C C C C C C C C C
charge: -0.296658 -0.324299 -0.284549 -0.070978 -0.074914 0.011457 0.024199 0.017735 0.011718 -0.009159 -0.000470 0.046122 0.193740 0.017166 0.061217 0.233329 0.133497 0.040486 0.299903 0.267133 0.033968 -0.061351 -0.188411 -0.049980 -0.029787 -0.001114
polarizability: 3.27395430e+02 8.06134658e+00 2.49310250e+02 1.43065722e+01 -1.91561969e+01 1.98201308e+02
1716.lowfreq: -9.4042 -6.5029 0.0005 0.0006 0.0008 4.4160 9.9191 22.6665 28.6513
frequency: 4.8171 22.6389 28.5312 31.8417 37.6058 46.9589 55.7259 61.9331 72.6452 78.7660 86.2558 104.3500 117.8130 129.2887 144.4341 165.6130 182.7201 186.8944 201.7939 208.0575 217.2332 228.0536 244.9081 279.1403 288.0464 294.3088 314.8659 328.1703 338.6528 355.7416 373.0185 393.0779 402.8472 408.5483 443.0724 481.0117 499.8218 518.4365 526.2466 545.9452 591.0434 609.4113 681.7722 691.9269 700.5714 724.4980 731.0300 750.1346 762.0420 771.1121 780.4454 794.0431 837.9820 847.7577 861.1987 862.3061 865.3461 883.0625 891.8012 907.8158 918.0002 926.3713 940.6630 947.1605 949.4792 961.3095 971.7766 987.1358 988.9955 990.9673 1002.1538 1020.8680 1025.9252 1027.1533 1045.3277 1050.0660 1062.5886 1082.7902 1088.7303 1107.2592 1109.5045 1119.5790 1121.5008 1143.3301 1151.3040 1160.5412 1173.4217 1179.1239 1188.6536 1191.8032 1202.8349 1208.1774 1209.6470 1223.2435 1225.0962 1231.1229 1257.2074 1270.4061 1272.2400 1276.8183 1286.0742 1293.0826 1295.7742 1308.5737 1314.1064 1330.6770 1335.9811 1339.4349 1341.1248 1346.5998 1354.4995 1359.9603 1361.9915 1364.5244 1375.6700 1384.6449 1389.6923 1392.2303 1394.7296 1448.8722 1451.9002 1452.4151 1457.0607 1463.0000 1463.2068 1463.9230 1467.4285 1470.0793 1474.1915 1475.8809 1476.3542 1477.6842 1478.8529 1482.1455 1486.4308 1488.2289 1543.1397 1603.4897 1621.2746 1659.0247 2808.4777 2843.8985 2856.2903 2909.4652 2926.2738 2957.7604 2959.1547 2963.4805 2967.9988 2968.3020 2972.6520 2976.5517 2984.6452 2985.0837 2998.7274 2999.8369 3004.4810 3005.4732 3011.0079 3021.8814 3024.7465 3032.6302 3037.5475 3040.3868 3049.3036 3050.1458 3065.4467 3069.4326 3071.4062 3117.8237 3135.5987 3160.4047 3183.9053 3270.9413
redmass: 4.2550 4.1907 4.1332 4.0311 2.7542 3.6360 4.1994 1.9866 4.1239 3.8247 3.6007 4.1429 3.3259 3.2610 1.9548 3.1327 2.9692 2.4251 3.4757 2.6417 2.3011 1.5167 3.0964 4.6744 3.7418 1.9192 3.1842 3.1752 3.1635 2.6844 3.1901 2.7547 2.3050 3.6445 3.2431 3.0229 1.8461 2.9723 2.0649 3.4298 5.7109 5.9094 2.8724 6.5146 5.3675 1.9952 1.4057 1.3055 1.3229 2.0676 1.9682 2.9587 3.3828 2.6487 2.1631 1.8411 2.1608 1.5043 1.4912 2.2629 1.2601 1.9075 1.7800 1.9786 1.5439 2.3482 3.0553 2.0067 1.9922 1.4372 1.8669 1.9913 2.5605 2.9733 2.1938 2.7448 2.8670 1.9247 2.0885 2.0185 2.0869 2.8489 2.2932 1.7483 1.9653 1.9211 1.1196 3.0286 1.2621 1.2367 1.7222 1.4245 1.3992 1.2249 1.3028 1.2707 1.1424 1.2985 1.4606 1.1324 1.1111 1.1451 1.3825 1.2566 1.9774 1.2576 1.3829 1.3535 1.4304 1.3465 1.3700 1.4076 1.4295 1.5820 1.4505 2.6881 1.2326 1.7984 1.4165 2.5903 1.0873 1.0874 1.0806 1.1060 1.1127 1.0776 1.0715 1.0920 1.1124 1.0965 1.2460 1.1007 1.0818 1.5531 1.0847 1.0854 2.2998 4.2046 5.1195 7.5487 1.0708 1.0717 1.0707 1.0638 1.0554 1.0598 1.0599 1.0641 1.0642 1.0687 1.0361 1.0644 1.0936 1.0675 1.0958 1.0591 1.0956 1.0913 1.0925 1.0989 1.0953 1.0905 1.1000 1.0879 1.1005 1.1016 1.1046 1.1000 1.0999 1.0879 1.0892 1.0976 1.0956 1.0797
irintensity: 0.0501 0.1080 0.2869 0.0506 0.5176 0.6364 1.5954 0.3765 0.5079 1.1194 0.2051 0.6220 0.2232 2.4397 0.2007 11.9623 0.8211 3.8748 0.9619 7.1633 3.1561 1.4316 2.0945 2.8637 6.9700 2.1775 4.3057 1.1299 1.3177 0.8162 1.4057 0.3449 2.5573 0.5119 5.3585 15.0400 1.4221 5.0499 0.6414 2.0642 3.2080 0.6859 13.3688 8.8543 8.6670 8.3137 6.7605 6.6714 80.0164 1.3505 6.7814 3.5827 9.0958 6.7217 6.6543 1.9332 3.7473 6.4659 1.8819 33.0003 59.9961 18.5235 15.6713 4.7713 9.6911 28.4940 78.7579 26.2764 49.2593 5.8717 2.5580 15.2718 44.0427 98.5887 27.6326 84.5322 28.9298 10.6505 14.6509 32.1865 3.3103 30.5712 5.3399 6.0410 6.6160 20.4405 23.5769 469.7730 5.5167 11.0578 7.7942 2.3219 13.7125 9.8976 4.3663 8.1821 10.8478 3.0386 12.6264 1.5380 0.2197 2.9155 25.4248 2.7238 77.2891 59.8078 0.6819 10.6542 4.6042 1.9908 7.1027 1.8644 1.7075 4.4422 10.6657 30.8045 12.0801 9.3619 0.2548 110.9168 5.9560 3.8370 13.2906 4.2809 7.0838 4.4007 2.1591 2.5763 17.2816 6.1087 12.6755 19.3979 19.0470 21.0251 13.8937 16.7978 347.5646 250.0638 15.2224 230.4459 104.8626 41.3165 226.0829 37.1347 83.8713 21.8469 17.9312 36.9748 75.8717 8.8636 38.8246 27.3460 55.5928 72.9206 46.4358 23.6267 23.8085 52.2025 22.9290 8.2835 78.5899 15.1015 45.6020 21.4350 113.3916 36.6885 38.0048 71.0605 66.5701 9.4281 16.5846 30.5403 6.8884 406.7841
temp: 298.150 k
press: 1.00000 atm
elementType: 8 8 8 7 7 6 6 6 6 6 6 6 6 6 6 6 6 6 6 6 6 6 6 6 6 6 1 1 1 1 1 1 1 1 1 1 1 1 1 1 1 1 1 1 1 1 1 1 1 1 1 1 1 1 1 1 1 1 1 1
symmnumber: 1
zpe: 1366198.3 jmol-1
zpe.correction: 0.520357 hartree
zpe.thermalcorrener: 0.548225 hartree
zpe.thermalcorrenthalpy: 0.549169 hartree
zpe.thermalcorrgfe: 0.457526 hartree
zpe.sumelectzpe: -1153.756974 hartree
zpe.sumelectthermal: -1153.729106 hartree
zpe.sumelectthermalent: -1153.728162 hartree
zpe.sumelectthermalfe: -1153.819805 hartree
dipole: -2.4187 2.4170 -2.5923
dipole: 4.2909
quadrupole: -149.4314 -157.6997 -154.6181
quadrupole: 13.5298 -3.0791 -4.7169
quadrupole: 4.4850 -3.7833 -0.7017 13.5298 -3.0791 -4.7169
hfenergy: -1154.2773311 hartree
pointgroup: C01 [X(C21H34N2O3)]
dipole: -0.9250155 1.0213668 -0.9752427 debye
polarizability: 328.3853108|3.8429263|249.8410286|11.3120661|-18.3600363|196.680649 unknown
InChI: InChI=1S/C21H34N2O3/c1-2-3-10-16-25-18-19-11-6-7-12-20(19)22-21(24)26-17-15-23-13-8-4-5-9-14-23/h6-7,11-12,22H,2-5,8-10,13-18H2,1H3
charge 0 multiplicity 1
60 atoms
O  -0.021404 -1.845647 -0.250583
O  1.76879 1.645144 -0.76975
O  1.733644 -3.194317 0.575422
N  -3.017287 -1.474967 -0.388021
N  2.035899 -0.953128 -0.163989
C  -3.751149 -0.886462 -1.534307
C  -3.845467 -1.708514 0.826316
C  -4.41995 0.478889 -1.255806
C  -4.136112 -0.41151 1.61748
C  -5.67456 0.401854 -0.350462
C  -5.386882 0.396692 1.174745
C  -2.240808 -2.675414 -0.785695
C  -0.992515 -2.917203 0.066193
C  -0.52136 2.439699 -0.97682
C  -0.499912 3.300592 0.306037
C  1.321395 -2.101231 0.106628
C  0.841008 2.356032 -1.673486
C  -1.875598 3.366981 1.007388
C  3.939802 0.519628 -0.474019
C  3.414884 -0.70776 0.0452
C  3.10807 1.42245 -1.365727
C  -1.856577 4.243333 2.278129
C  5.292961 0.840185 -0.227044
C  4.261595 -1.600604 0.751929
C  6.138428 -0.040432 0.484868
C  5.615643 -1.264103 0.960871
H  -3.016798 -0.759281 -2.353323
H  -4.547219 -1.582715 -1.91651
H  -3.274412 -2.390164 1.483204
H  -4.800555 -2.239601 0.576273
H  -3.671509 1.17609 -0.831759
H  -4.720197 0.890931 -2.240438
H  -4.249723 -0.662239 2.691118
H  -3.226452 0.212573 1.53392
H  -6.347714 1.253017 -0.573916
H  -6.241072 -0.511608 -0.627199
H  -6.284167 0.006378 1.695786
H  -5.259034 1.440868 1.524685
H  -1.911081 -2.550002 -1.833174
H  -2.860667 -3.608582 -0.754467
H  -1.209519 -2.883042 1.150152
H  -0.5365 -3.897643 -0.165642
H  -0.866911 1.412959 -0.739758
H  -1.24952 2.863972 -1.699112
H  0.254644 2.889969 1.003771
H  -0.168789 4.330125 0.052225
H  1.247012 3.36957 -1.883838
H  0.768042 1.798485 -2.633713
H  -2.197183 2.338255 1.270388
H  -2.632855 3.7585 0.296239
H  2.964483 0.951988 -2.366528
H  3.616498 2.396577 -1.511277
H  1.494417 -0.112711 -0.440988
H  -2.848139 4.272417 2.766512
H  -1.127898 3.85477 3.014102
H  -1.566926 5.283929 2.037924
H  5.692187 1.788287 -0.608511
H  3.848846 -2.542023 1.12177
H  7.185928 0.224234 0.662521
H  6.260746 -1.960272 1.508565
