program: Orca
programVersion: 5.0.2
elementType: F F F O O O O N C C C C C C C C C C C C C C C C C C C C C C C C H H H H H H H H H H H H H H H H H H H H H H H H
charge: 0
multiplicity: 1
keywords: wb97x-d3
keywords: def2-TZVPP
keywords: def2/J RIJCOSX
keywords: DEFGRID2
keywords: scfconv7
keywords: smallprint printgap noloewdin
keywords: NOSOSCF
formula: C24H24F3NO4
InChI: InChI=1/C24H24F3NO4/c1-22(2,3)16-9-11-17(12-10-16)23(15-28,21(30)32-14-13-31-4)20(29)18-7-5-6-8-19(18)24(25,26)27/h5-12H,13-14H2,1-4H3
56 atoms
F  0.703153 2.815472 1.604274
F  -0.531726 1.410215 2.672185
F  -1.210318 3.422227 2.356646
O  -1.89122 -2.551647 -0.12789
O  -2.720752 -0.606861 1.988269
O  -0.184866 -3.611891 0.8674
O  -1.700475 -2.551086 -2.938264
N  -0.065857 -1.79582 3.828508
C  3.913529 1.382733 -1.4390
C  2.823668 0.616285 -0.700706
C  4.585788 0.46163 -2.462992
C  3.269215 2.571949 -2.163146
C  4.985942 1.91919 -0.492496
C  -0.526019 -1.275103 1.315907
C  0.694057 -0.686753 0.617971
C  1.752579 0.065727 -1.411287
C  2.820173 0.446982 0.678087
C  0.708178 -0.574353 -0.772809
C  1.774131 -0.193788 1.330649
C  -1.790747 -0.349436 1.279733
C  -0.850331 -2.638234 0.662069
C  -1.815503 0.772033 0.286013
C  -0.26068 -1.568703 2.720479
C  -1.205287 2.009906 0.485777
C  -2.485667 0.530127 -0.910446
C  -1.230741 2.965234 -0.524247
C  -0.557236 2.408003 1.777486
C  -2.266877 -3.68554 -0.9344
C  -2.504776 1.485664 -1.912189
C  -1.862725 2.699319 -1.726149
C  -1.475121 -3.732625 -2.21469
C  -0.961614 -2.500024 -4.13408
H  5.055554 -0.395876 -1.977153
H  3.879673 0.079843 -3.201889
H  5.363953 1.001944 -3.00643
H  2.766425 3.239337 -1.460121
H  2.531905 2.253328 -2.901607
H  4.02798 3.154863 -2.689672
H  5.737501 2.467897 -1.062767
H  5.504536 1.120441 0.041054
H  4.576044 2.608949 0.247798
H  1.716237 0.145679 -2.490716
H  3.630121 0.829877 1.283085
H  -0.099744 -0.966677 -1.377173
H  1.820694 -0.283251 2.408314
H  -2.979468 -0.417228 -1.073213
H  -0.759825 3.929268 -0.378617
H  -3.327137 -3.540713 -1.1352
H  -2.145186 -4.614546 -0.377279
H  -3.018989 1.27508 -2.840477
H  -1.864629 3.445803 -2.508897
H  -0.405967 -3.876961 -2.00818
H  -1.811744 -4.61845 -2.772488
H  -1.179231 -1.550258 -4.622122
H  0.11872 -2.557093 -3.955482
H  -1.234284 -3.310703 -4.820512
elementType: F O N C H
totalener: -1584.35459221 hartree
nucrepener: 3565.32608958 hartree
electener: -5149.68068179 hartree
oneelecener: -9260.34926760 hartree
twoeener: 4110.66858581 hartree
cpcmener: -0.03926392 hartree
kineticenergy: 1577.89489147 hartree
xcener: -146.958584491064 hartree
chargesum: 0.0000000
charge: -0.173261 -0.173741 -0.174930 -0.237995 -0.314127 -0.392866 -0.370331 -0.046999 0.334311 -0.098224 -0.325848 -0.331924 -0.357409 0.621648 -0.082999 -0.208960 -0.113993 -0.220908 -0.215060 0.217146 0.328849 0.149709 -0.325820 -0.128056 -0.197204 -0.146811 0.555070 -0.016215 -0.130862 -0.142830 0.008717 -0.118282 0.102912 0.096485 0.097733 0.101395 0.096861 0.099264 0.100470 0.102168 0.102508 0.139511 0.146361 0.126451 0.132936 0.146141 0.143815 0.118885 0.122562 0.162780 0.163324 0.101425 0.109834 0.115098 0.095809 0.105477
qa: -0.1733 -0.1737 -0.1749 -0.2380 -0.3141 -0.3929 -0.3703 -0.0470 0.3343 -0.0982 -0.3258 -0.3319 -0.3574 0.6216 -0.0830 -0.2090 -0.1140 -0.2209 -0.2151 0.2171 0.3288 0.1497 -0.3258 -0.1281 -0.1972 -0.1468 0.5551 -0.0162 -0.1309 -0.1428 0.0087 -0.1183 0.1029 0.0965 0.0977 0.1014 0.0969 0.0993 0.1005 0.1022 0.1025 0.1395 0.1464 0.1265 0.1329 0.1461 0.1438 0.1189 0.1226 0.1628 0.1633 0.1014 0.1098 0.1151 0.0958 0.1055
va: 1.1215 1.1249 1.1308 2.1868 2.1542 2.1238 1.9174 3.1083 3.6308 3.7778 3.9190 3.9227 3.9285 3.3968 3.5598 4.0692 3.8955 4.0745 4.0057 4.0043 4.2818 3.4204 4.1181 3.7690 3.9363 3.9669 4.4215 3.8560 3.9189 3.9003 3.9000 3.8908 1.0037 1.0044 1.0028 1.0055 1.0039 1.0047 1.0071 1.0005 1.0005 1.0043 0.9963 1.0216 1.0233 1.0231 1.0081 1.0045 1.0139 0.9888 0.9877 0.9988 1.0007 0.9909 0.9910 0.9925
dispcorr: -0.037221145 hartree
energy: -1584.391813351001
dipole: 27.30941 -27.13591 0.17350 -8.13232 8.86514 0.73283 -46.40802 41.14912 -5.25891
magnitude: 5.31256 au
magnitude: 13.50344 debye
