program: Orca
programVersion: 5.0.2
elementType: F F F O O O O N C C C C C C C C C C C C C C C C C C C C C C C C H H H H H H H H H H H H H H H H H H H H H H H H
charge: 0
multiplicity: 1
keywords: wb97x-d3
keywords: def2-TZVPP
keywords: def2/J RIJCOSX
keywords: DEFGRID2
keywords: scfconv7
keywords: smallprint printgap noloewdin
keywords: NOSOSCF
formula: C24H24F3NO4
InChI: InChI=1/C24H24F3NO4/c1-22(2,3)16-9-11-17(12-10-16)23(15-28,21(30)32-14-13-31-4)20(29)18-7-5-6-8-19(18)24(25,26)27/h5-12H,13-14H2,1-4H3
56 atoms
F  -3.604788 1.792728 -0.557833
F  -4.714675 1.195098 1.176696
F  -3.375804 -0.195843 0.242314
O  -1.429984 -2.15802 -1.044354
O  -0.961913 0.806157 -1.115004
O  0.620117 -1.97505 -1.932899
O  -3.024835 -2.578459 -4.257115
N  -0.824611 -2.136249 2.263137
C  5.805527 0.469117 0.5131
C  4.329435 0.096429 0.463124
C  6.486376 -0.037696 1.783059
C  6.511377 -0.149583 -0.700359
C  5.951466 1.995048 0.463396
C  0.107648 -0.886545 0.173972
C  1.590035 -0.562498 0.292404
C  3.532893 0.5508 -0.59107
C  3.714666 -0.70131 1.42186
C  2.191105 0.234442 -0.679985
C  2.36629 -1.028254 1.341584
C  -0.697302 0.43271 -0.005705
C  -0.182829 -1.747088 -1.077708
C  -1.078143 1.199385 1.216467
C  -0.404655 -1.589058 1.344918
C  -2.407902 1.565651 1.464875
C  -0.083175 1.603499 2.098956
C  -2.708995 2.34478 2.571276
C  -3.526256 1.093645 0.578778
C  -1.969601 -2.84695 -2.181778
C  -0.3934 2.390144 3.198088
C  -1.703892 2.764787 3.43079
C  -2.432707 -1.840987 -3.220979
C  -3.513996 -1.76227 -5.291813
H  6.030394 0.372312 2.686481
H  6.465729 -1.126489 1.858603
H  7.535024 0.264673 1.783102
H  7.573789 0.10405 -0.693524
H  6.095296 0.209467 -1.643007
H  6.430188 -1.238357 -0.6947
H  7.006205 2.274623 0.508607
H  5.445798 2.471984 1.305361
H  5.544144 2.421507 -0.454248
H  3.961029 1.169146 -1.370036
H  4.276509 -1.087911 2.260691
H  1.624739 0.620019 -1.5173
H  1.939833 -1.649646 2.118873
H  0.947837 1.331415 1.921773
H  -3.729761 2.630241 2.783646
H  -2.813429 -3.414676 -1.792935
H  -1.239302 -3.545488 -2.592589
H  0.395234 2.706834 3.867128
H  -1.955309 3.377344 4.285952
H  -3.147796 -1.141405 -2.766521
H  -1.586187 -1.247777 -3.592967
H  -4.290749 -1.072423 -4.940818
H  -2.719594 -1.167925 -5.758894
H  -3.949392 -2.410306 -6.052337
elementType: F O N C H
totalener: -1584.35781294 hartree
nucrepener: 3379.04597713 hartree
electener: -4963.40379006 hartree
oneelecener: -8888.33223864 hartree
twoeener: 3924.92844857 hartree
cpcmener: -0.03323667 hartree
kineticenergy: 1577.89678039 hartree
xcener: -146.958190663877 hartree
chargesum: -0.0000000
charge: -0.175174 -0.174439 -0.178235 -0.260221 -0.319135 -0.377852 -0.377685 -0.049461 0.318715 -0.119399 -0.354982 -0.324601 -0.328961 0.844296 -0.214616 -0.177434 -0.110551 -0.188090 -0.175300 0.210239 0.315425 0.072731 -0.417289 -0.242275 -0.192732 -0.043055 0.551882 0.007718 -0.107412 -0.152882 0.037425 -0.112242 0.104171 0.099517 0.100208 0.097302 0.097577 0.103690 0.097476 0.102555 0.097122 0.145254 0.146612 0.148229 0.132998 0.167500 0.147797 0.121713 0.106890 0.161519 0.163985 0.075761 0.096119 0.092931 0.092873 0.115793
qa: -0.1752 -0.1744 -0.1782 -0.2602 -0.3191 -0.3779 -0.3777 -0.0495 0.3187 -0.1194 -0.3550 -0.3246 -0.3290 0.8443 -0.2146 -0.1774 -0.1106 -0.1881 -0.1753 0.2102 0.3154 0.0727 -0.4173 -0.2423 -0.1927 -0.0431 0.5519 0.0077 -0.1074 -0.1529 0.0374 -0.1122 0.1042 0.0995 0.1002 0.0973 0.0976 0.1037 0.0975 0.1026 0.0971 0.1453 0.1466 0.1482 0.1330 0.1675 0.1478 0.1217 0.1069 0.1615 0.1640 0.0758 0.0961 0.0929 0.0929 0.1158
va: 1.1204 1.1303 1.1205 2.1810 2.1231 2.1254 1.9380 3.1128 3.6630 3.8241 3.9269 3.9187 3.9186 3.1207 3.7467 4.0425 3.9100 4.0264 3.9998 3.7634 4.2864 3.4404 4.1767 3.9277 3.9417 3.8602 4.4310 3.8240 3.9230 3.9307 3.9087 3.9122 1.0006 1.0008 1.0069 1.0030 1.0039 1.0037 1.0032 1.0034 1.0046 1.0015 0.9976 1.0192 1.0207 0.9926 1.0068 1.0014 1.0161 0.9910 0.9890 1.0035 1.0025 0.9889 0.9894 0.9916
dispcorr: -0.031756179 hartree
energy: -1584.389569116827
dipole: 54.04238 -52.63673 1.40565 -0.67464 2.66574 1.99110 -9.28541 10.26868 0.98327
magnitude: 2.62815 au
magnitude: 6.68022 debye
