program: Orca
programVersion: 5.0.2
elementType: F F F O O O O N C C C C C C C C C C C C C C C C C C C C C C C C H H H H H H H H H H H H H H H H H H H H H H H H
charge: 0
multiplicity: 1
keywords: wb97x-d3
keywords: def2-TZVPP
keywords: def2/J RIJCOSX
keywords: DEFGRID2
keywords: scfconv7
keywords: smallprint printgap noloewdin
keywords: NOSOSCF
formula: C24H24F3NO4
InChI: InChI=1/C24H24F3NO4/c1-22(2,3)16-9-11-17(12-10-16)23(15-28,21(30)32-14-13-31-4)20(29)18-7-5-6-8-19(18)24(25,26)27/h5-12H,13-14H2,1-4H3
56 atoms
F  -4.740804 1.430885 1.026984
F  -3.450413 0.102144 -0.052405
F  -3.403029 2.222736 -0.447848
O  -1.431892 -1.944594 -1.253537
O  -0.877152 1.005965 -0.966101
O  0.627461 -1.724792 -2.112481
O  -3.006357 -2.117934 -4.499688
N  -0.781802 -2.383116 2.014853
C  5.851416 0.373119 0.539877
C  4.369099 0.03001 0.463811
C  6.016383 1.891397 0.679445
C  6.539732 -0.296395 1.727718
C  6.535884 -0.098746 -0.749378
C  0.131608 -0.863392 0.103344
C  1.618034 -0.565002 0.246307
C  3.573298 0.604248 -0.53082
C  3.747188 -0.851056 1.341097
C  2.22566 0.320239 -0.64196
C  2.393388 -1.147274 1.236661
C  -0.674218 0.470742 0.088804
C  -0.173712 -1.567072 -1.240115
C  -1.134355 1.03647 1.388302
C  -0.370843 -1.716123 1.175025
C  -2.452735 1.47524 1.581809
C  -0.212422 1.17405 2.420107
C  -2.810141 2.04674 2.793496
C  -3.509592 1.310201 0.523177
C  -1.972757 -2.540662 -2.441954
C  -0.576326 1.760629 3.621972
C  -1.874694 2.197581 3.80722
C  -2.394806 -1.460571 -3.421506
C  -3.473475 -1.227117 -5.481646
H  5.529636 2.263373 1.583092
H  7.074915 2.152949 0.741017
H  5.598358 2.43299 -0.170205
H  6.498674 -1.385762 1.670647
H  6.105051 0.008618 2.681683
H  7.59391 -0.014907 1.74718
H  6.438871 -1.178656 -0.877835
H  7.601827 0.138073 -0.723326
H  6.116672 0.380021 -1.635795
H  4.007877 1.292415 -1.244674
H  4.307219 -1.330446 2.131714
H  1.661227 0.798833 -1.430625
H  1.962022 -1.839555 1.94841
H  0.809503 0.84803 2.28486
H  -3.823644 2.378113 2.969596
H  -2.837163 -3.108558 -2.101496
H  -1.254776 -3.231498 -2.886341
H  0.158321 1.870621 4.408069
H  -2.172842 2.649173 4.743474
H  -3.088942 -0.765415 -2.929551
H  -1.527256 -0.875366 -3.755582
H  -2.662703 -0.631534 -5.917755
H  -3.932716 -1.814979 -6.276165
H  -4.226411 -0.53534 -5.085716
elementType: F O N C H
totalener: -1584.35794417 hartree
nucrepener: 3368.30435796 hartree
electener: -4952.66230213 hartree
oneelecener: -8866.85458918 hartree
twoeener: 3914.19228705 hartree
cpcmener: -0.03333837 hartree
kineticenergy: 1577.89067283 hartree
xcener: -146.957384649610 hartree
chargesum: 0.0000000
charge: -0.175732 -0.177828 -0.173978 -0.261276 -0.324675 -0.377425 -0.377220 -0.047238 0.317360 -0.115618 -0.328383 -0.356935 -0.324723 0.847392 -0.194971 -0.184899 -0.109945 -0.187443 -0.191256 0.207075 0.309765 0.093912 -0.419885 -0.250287 -0.214636 -0.038448 0.547618 0.005130 -0.104390 -0.152282 0.036620 -0.112586 0.102848 0.097254 0.098072 0.100498 0.103853 0.100291 0.103705 0.097152 0.097578 0.145103 0.146602 0.148624 0.135648 0.181812 0.148641 0.121546 0.108164 0.161544 0.164187 0.076089 0.096263 0.093000 0.115865 0.092850
qa: -0.1757 -0.1778 -0.1740 -0.2613 -0.3247 -0.3774 -0.3772 -0.0472 0.3174 -0.1156 -0.3284 -0.3569 -0.3247 0.8474 -0.1950 -0.1849 -0.1099 -0.1874 -0.1913 0.2071 0.3098 0.0939 -0.4199 -0.2503 -0.2146 -0.0384 0.5476 0.0051 -0.1044 -0.1523 0.0366 -0.1126 0.1028 0.0973 0.0981 0.1005 0.1039 0.1003 0.1037 0.0972 0.0976 0.1451 0.1466 0.1486 0.1356 0.1818 0.1486 0.1215 0.1082 0.1615 0.1642 0.0761 0.0963 0.0930 0.1159 0.0928
va: 1.1271 1.1234 1.1207 2.1790 2.1203 2.1267 1.9377 3.1137 3.6646 3.8184 3.9190 3.9266 3.9194 3.1313 3.7508 4.0526 3.9055 4.0436 3.9991 3.7802 4.2852 3.4350 4.1977 3.9519 3.9348 3.8496 4.4328 3.8255 3.9248 3.9361 3.9080 3.9122 1.0035 1.0032 1.0043 1.0007 1.0004 1.0071 1.0035 1.0030 1.0041 1.0016 0.9977 1.0197 1.0206 0.9827 1.0071 1.0020 1.0151 0.9909 0.9890 1.0037 1.0023 0.9893 0.9917 0.9889
dispcorr: -0.031353211 hartree
energy: -1584.389297378342
dipole: 53.90896 -52.65388 1.25508 -2.66390 4.31768 1.65377 -8.21326 9.51976 1.30650
magnitude: 2.45299 au
magnitude: 6.23500 debye
