program: Gaussian 09
title: 000054504
version: EM64L-G09RevD.01
frameworkgroup: C1[X(C18H28N2O3)]
method: RPBEPBE
basis: SDD
operation: Freq
keyword: #p
keyword: freq=noraman
keyword: PBEPBE/SDD
title: #p freq=noraman PBEPBE/SDD
converged: YES YES NO NO
title: Mulliken charges:
elementType: O O O N N C C C C C C C C C C C C C C C C C C H H H H H H H H H H H H H H H H H H H H H H H H H H H H
charge: -0.315897 -0.320765 -0.277010 -0.081034 -0.472054 -0.370018 -0.363175 -0.387199 -0.393143 -0.398516 -0.346964 -0.261756 0.241952 0.270436 0.296247 -0.405396 -0.344882 -0.415766 -0.210663 -0.384143 -0.228717 -0.255572 -0.677705 0.212404 0.167164 0.173045 0.209589 0.191830 0.205505 0.207632 0.192590 0.214817 0.188403 0.194638 0.212895 0.236581 0.228480 0.392154 0.218242 0.213472 0.297732 0.226769 0.198560 0.185662 0.191696 0.220815 0.227061 0.227475 0.200046 0.252087 0.214392
chargesum: 0.00000
title: Mulliken charges with hydrogens summed into heavy atoms:
elementType: O O O N N C C C C C C C C C C C C C C C C C C
charge: -0.315897 -0.320765 -0.277010 -0.081034 -0.079900 0.009550 0.019460 0.010136 0.007080 0.004704 0.060569 0.203305 0.241952 0.270436 0.296247 0.026318 -0.047150 -0.188997 0.173559 0.028368 -0.001656 -0.028097 -0.011180
polarizability: 3.07296213e+02 -1.38790239e+01 2.29625523e+02 3.62996480e+00 -1.00219289e+01 1.44996701e+02
1716.lowfreq: -23.6382 -0.8709 -0.0009 -0.0006 0.0004 3.6803 6.3778 15.8559 23.8167
frequency: -21.1517 15.5419 23.7687 29.9516 51.9173 63.0999 69.0500 80.4537 86.9543 101.5889 119.7548 137.2422 155.2995 159.1757 175.0003 183.7398 212.3170 230.3928 251.1983 272.0015 285.2897 288.8573 313.6132 331.2217 358.6556 377.8516 396.1924 416.5604 435.3735 451.2387 466.6521 500.1534 543.0333 558.7980 598.2855 610.8115 693.3977 697.6531 724.0290 753.5116 757.7551 763.5146 793.0771 804.3915 805.9529 844.6672 850.0400 855.1875 874.0074 882.1021 889.4649 896.6526 905.2020 918.5950 923.6510 947.8225 956.9664 985.7974 990.2004 992.7507 994.3221 1007.3402 1045.2874 1047.9325 1050.8409 1082.8941 1087.8397 1100.8262 1101.3013 1115.6043 1116.7910 1125.4803 1137.9477 1150.9733 1159.9349 1174.1988 1176.5563 1181.5875 1198.4965 1206.5535 1227.9980 1243.9041 1259.6115 1265.8057 1272.5673 1275.6139 1284.3248 1293.2280 1310.6098 1320.0255 1330.8807 1333.8487 1340.5143 1347.3635 1349.7084 1353.9931 1370.7303 1382.5525 1389.3694 1398.3774 1400.7696 1447.5081 1450.9230 1455.2451 1459.2686 1460.1438 1464.9076 1465.4707 1471.8826 1474.7314 1478.4533 1479.4928 1485.7848 1486.3767 1491.7185 1540.5696 1603.5698 1620.9929 1659.5919 2818.9120 2828.9058 2884.2690 2911.9548 2923.7730 2967.5707 2974.8030 2980.0491 2985.8468 2987.5726 2992.9398 2994.2615 3016.7049 3023.6248 3033.1411 3037.2077 3038.4770 3042.4830 3047.1534 3056.1790 3071.5883 3088.7105 3093.8818 3118.5647 3136.3786 3161.0369 3186.6574 3301.4828
redmass: 2.9152 3.0592 4.0357 4.0992 3.4828 5.1076 3.2447 5.4404 3.7628 2.8705 2.4014 3.2246 3.5003 3.2882 2.8566 3.0003 2.0653 1.8828 2.3103 3.7831 4.5820 3.6164 2.3687 2.7693 3.8031 2.1107 3.2747 3.1231 2.8937 2.8966 3.0705 2.9095 3.4847 1.9770 5.1402 6.1570 9.0979 7.2313 3.0267 1.6250 2.7538 1.3502 1.3177 2.3350 1.7279 3.7425 1.5116 2.5355 1.5062 1.7505 1.7815 1.9524 2.2724 1.6155 3.6901 1.4086 1.3066 2.3092 1.4369 2.5330 2.6126 6.9809 2.0074 2.1309 1.8997 2.1631 2.8063 1.8326 1.7942 1.9984 2.0630 2.0528 1.7216 1.3285 2.3502 1.2311 1.6142 1.6032 1.2157 1.8549 1.1946 1.6650 1.2434 1.1836 1.4462 1.2088 1.2172 1.3982 1.8701 1.4080 1.3069 1.2548 1.4167 1.4975 1.4949 1.4240 1.4407 3.0888 1.5762 1.5348 1.3416 2.6260 1.0902 1.0778 1.0847 1.0877 1.0911 1.1307 1.0879 1.1044 1.1210 1.6138 1.1286 1.1675 1.0554 2.2130 4.4248 5.0726 7.7842 1.0715 1.0700 1.0698 1.0625 1.0570 1.0627 1.0887 1.0404 1.0616 1.0609 1.0923 1.0794 1.0585 1.0878 1.0925 1.0882 1.0907 1.0991 1.1033 1.1036 1.0992 1.1084 1.0995 1.0878 1.0893 1.0978 1.0953 1.0800
irintensity: 0.2019 0.6863 0.0663 0.0789 0.1498 1.6485 0.2374 0.4837 0.5785 1.0183 0.3618 1.6369 8.6648 0.8840 7.2751 1.1134 0.4802 2.6813 4.5202 5.9137 3.1270 4.5765 9.1473 0.2433 6.5757 4.9810 7.1774 7.6573 4.6306 0.3318 3.0169 5.2125 2.6812 1.0915 3.4553 0.6257 5.6697 23.9300 6.9507 4.9348 2.3028 81.4765 0.8613 3.7376 0.7773 23.8956 2.1458 6.9795 1.8194 46.4223 30.3242 16.2068 5.4018 1.6516 6.8295 10.3851 2.8261 39.6687 15.9962 87.1185 2.3231 342.2886 42.1797 1.1639 21.6385 36.5492 18.3063 3.4611 35.3564 47.6053 2.4198 3.6406 1.5581 5.8451 62.2102 80.2596 240.2870 159.6206 9.0889 14.9566 6.5734 8.1340 1.8835 4.3946 8.1291 8.5323 10.7505 10.0717 90.9580 3.6991 0.4709 41.3097 0.3401 2.6248 1.2688 2.0364 1.4888 66.4221 0.9980 5.2066 16.8719 117.1677 7.1604 8.5383 4.8018 12.4388 10.4372 18.7917 8.0152 10.8847 5.7279 3.6299 21.6122 9.4422 20.4502 396.6547 237.9598 11.2320 224.5601 45.1634 136.6183 114.3479 27.4674 96.3960 39.2169 12.9437 42.4998 32.8572 35.7026 80.6542 39.0112 28.8613 46.5850 71.2869 37.7886 15.9871 17.1190 18.1941 94.9004 51.8333 36.1927 35.9300 9.8016 16.1912 29.9050 6.7891 386.2219
temp: 298.150 k
press: 1.00000 atm
elementType: 8 8 8 7 7 6 6 6 6 6 6 6 6 6 6 6 6 6 6 6 6 6 6 1 1 1 1 1 1 1 1 1 1 1 1 1 1 1 1 1 1 1 1 1 1 1 1 1 1 1 1
symmnumber: 1
zpe: 1145859.1 jmol-1
zpe.correction: 0.436435 hartree
zpe.thermalcorrener: 0.459528 hartree
zpe.thermalcorrenthalpy: 0.460472 hartree
zpe.thermalcorrgfe: 0.381393 hartree
zpe.sumelectzpe: -1036.099990 hartree
zpe.sumelectthermal: -1036.076897 hartree
zpe.sumelectthermalent: -1036.075953 hartree
zpe.sumelectthermalfe: -1036.155032 hartree
dipole: -0.0222 4.5344 -0.3057
dipole: 4.5447
quadrupole: -117.6532 -134.6139 -141.0382
quadrupole: 5.5864 -4.8200 -5.3468
quadrupole: 13.4486 -3.5122 -9.9364 5.5864 -4.8200 -5.3468
hfenergy: -1036.5364248 hartree
pointgroup: C01 [X(C18H28N2O3)]
dipole: 0.0092349 1.7732603 0.2292448 debye
polarizability: 307.3302985|13.7600048|228.0963573|3.5051175|15.0403294|146.4917807 unknown
InChI: InChI=1S/C18H28N2O3/c1-2-13-22-15-16-8-4-5-9-17(16)19-18(21)23-14-12-20-10-6-3-7-11-20/h4-5,8-9,19H,2-3,6-7,10-15H2,1H3
charge 0 multiplicity 1
51 atoms
O  0.527655 -0.258664 0.225036
O  -2.800733 2.002001 -0.100312
O  -0.372828 -2.431871 0.118291
N  4.266744 -0.158432 0.202176
N  -1.717432 -0.470783 0.13518
C  5.213742 0.810793 0.811582
C  4.724817 -0.591323 -1.143996
C  6.623181 0.198445 0.944162
C  6.118486 -1.247452 -1.073311
C  7.142314 -0.284755 -0.429413
C  2.866518 0.325217 0.202185
C  1.887666 -0.854619 0.272136
C  -0.536659 -1.185373 0.154379
C  -3.033529 -0.984661 0.007034
C  -4.114018 -0.065399 0.194747
C  -3.878404 1.350057 0.683556
C  -3.303553 -2.34006 -0.316372
C  -5.438084 -0.521722 0.008914
C  -2.594492 3.408248 0.300366
C  -1.450966 3.994718 -0.534625
C  -4.637346 -2.771978 -0.47234
C  -5.712459 -1.867618 -0.321718
C  -0.063261 3.410142 -0.194779
H  4.828348 1.091246 1.809674
H  5.280742 1.752083 0.202338
H  4.765956 0.283287 -1.847799
H  3.992715 -1.307989 -1.558377
H  7.309946 0.949091 1.380859
H  6.572442 -0.658953 1.64277
H  6.047134 -2.172243 -0.469052
H  6.440045 -1.535644 -2.092721
H  8.126084 -0.779185 -0.32091
H  7.290983 0.591376 -1.094549
H  2.627457 0.951158 -0.692495
H  2.708359 0.961368 1.092341
H  2.012834 -1.418505 1.212609
H  2.002173 -1.556551 -0.573007
H  -1.6530 0.562489 0.101207
H  -3.572495 1.34939 1.755471
H  -4.810702 1.943504 0.591699
H  -2.469209 -3.034838 -0.433562
H  -6.265996 0.186726 0.136777
H  -3.539086 3.966742 0.122892
H  -2.358292 3.454905 1.387602
H  -1.444446 5.091095 -0.370877
H  -1.684079 3.832405 -1.604237
H  -4.832961 -3.820779 -0.722215
H  -6.745971 -2.202706 -0.45722
H  0.195306 3.594942 0.865493
H  -0.023092 2.320797 -0.365655
H  0.720049 3.878276 -0.81853
