program: Orca
programVersion: 5.0.2
elementType: F F F O O O O N C C C C C C C C C C C C C C C C C C C C C C C C H H H H H H H H H H H H H H H H H H H H H H H H
charge: 0
multiplicity: 1
keywords: wb97x-d3
keywords: def2-TZVPP
keywords: def2/J RIJCOSX
keywords: DEFGRID2
keywords: scfconv7
keywords: smallprint printgap noloewdin
keywords: NOSOSCF
formula: C24H24F3NO4
InChI: InChI=1/C24H24F3NO4/c1-22(2,3)16-9-11-17(12-10-16)23(15-28,21(30)32-14-13-31-4)20(29)18-7-5-6-8-19(18)24(25,26)27/h5-12H,13-14H2,1-4H3
56 atoms
F  -0.512718 1.960071 1.959417
F  -1.736282 3.224776 3.194136
F  -1.510085 3.664051 1.105511
O  -0.570788 -2.888887 -0.395853
O  -1.211984 1.412393 -0.988548
O  -1.70795 -1.556099 -1.805885
O  0.739768 -3.156556 -2.941085
N  -1.053118 -1.430856 2.586524
C  5.00079 0.602854 -0.962091
C  3.54596 0.288045 -0.637909
C  5.853718 0.755814 0.295955
C  5.580359 -0.53725 -1.808546
C  5.07319 1.913609 -1.754922
C  -0.636625 -0.617282 0.143864
C  0.83676 -0.314168 -0.116106
C  2.612764 0.164158 -1.670352
C  3.081502 0.10094 0.659042
C  1.284049 -0.126964 -1.423133
C  1.749166 -0.195259 0.919753
C  -1.521338 0.634798 -0.134201
C  -1.057008 -1.750073 -0.819335
C  -2.762101 0.819534 0.686046
C  -0.855827 -1.079485 1.510945
C  -2.841763 1.805254 1.673678
C  -3.870878 0.027884 0.416741
C  -4.027585 1.99148 2.368937
C  -1.65534 2.668336 1.986432
C  -0.635606 -4.062377 -1.229555
C  -5.055145 0.22466 1.111102
C  -5.133972 1.205073 2.08475
C  0.64221 -4.203689 -2.013832
C  1.989973 -3.106563 -3.581798
H  5.886233 -0.159318 0.890371
H  6.88125 0.994103 0.015799
H  5.498629 1.563601 0.93916
H  5.043351 -0.662205 -2.750289
H  5.541615 -1.48864 -1.274179
H  6.625638 -0.336198 -2.053462
H  6.111225 2.156156 -1.992481
H  4.660127 2.747212 -1.183491
H  4.53008 1.856949 -2.699456
H  2.919539 0.297077 -2.700354
H  3.752354 0.18193 1.502913
H  0.610994 -0.209021 -2.265594
H  1.448464 -0.336621 1.949921
H  -3.824077 -0.736733 -0.34702
H  -4.104439 2.746818 3.138863
H  -1.514589 -4.03379 -1.874279
H  -0.737078 -4.901308 -0.54305
H  -5.914418 -0.392648 0.885435
H  -6.054368 1.360591 2.631006
H  1.498836 -4.208587 -1.325386
H  0.625054 -5.185392 -2.508843
H  2.199588 -4.021676 -4.148853
H  1.975387 -2.269594 -4.279784
H  2.812323 -2.953779 -2.872692
elementType: F O N C H
totalener: -1584.35836890 hartree
nucrepener: 3438.87640275 hartree
electener: -5023.23477166 hartree
oneelecener: -9009.39365002 hartree
twoeener: 3986.15887836 hartree
cpcmener: -0.03772218 hartree
kineticenergy: 1577.88743655 hartree
xcener: -146.955727574807 hartree
chargesum: -0.0000000
charge: -0.173323 -0.171398 -0.170393 -0.265659 -0.305493 -0.381948 -0.364893 -0.047393 0.323145 -0.087185 -0.356928 -0.330605 -0.328018 0.739003 -0.072556 -0.211020 -0.141898 -0.285018 -0.157941 0.207382 0.287179 0.088324 -0.403061 -0.196486 -0.127492 -0.080045 0.544844 0.012448 -0.142885 -0.140681 0.023630 -0.133593 0.100343 0.099838 0.104121 0.094854 0.103031 0.100054 0.097102 0.104238 0.097017 0.143774 0.146551 0.146407 0.134039 0.157912 0.148894 0.108989 0.121874 0.162014 0.163937 0.088929 0.100126 0.110415 0.118011 0.097492
qa: -0.1733 -0.1714 -0.1704 -0.2657 -0.3055 -0.3819 -0.3649 -0.0474 0.3231 -0.0872 -0.3569 -0.3306 -0.3280 0.7390 -0.0726 -0.2110 -0.1419 -0.2850 -0.1579 0.2074 0.2872 0.0883 -0.4031 -0.1965 -0.1275 -0.0800 0.5448 0.0124 -0.1429 -0.1407 0.0236 -0.1336 0.1003 0.0998 0.1041 0.0949 0.1030 0.1001 0.0971 0.1042 0.0970 0.1438 0.1466 0.1464 0.1340 0.1579 0.1489 0.1090 0.1219 0.1620 0.1639 0.0889 0.1001 0.1104 0.1180 0.0975
va: 1.1194 1.1366 1.1273 2.1973 2.1637 2.0961 1.9308 3.1136 3.6485 3.7845 3.9272 3.9193 3.9190 3.3041 3.6522 4.0056 3.9601 4.0631 3.9876 3.8826 4.2913 3.5053 4.1458 3.8824 3.9017 3.9049 4.4379 3.8599 3.9524 3.9127 3.9245 3.9040 1.0005 1.0071 1.0005 1.0039 1.0034 1.0051 1.0031 1.0031 1.0039 1.0014 0.9972 1.0267 1.0196 1.0093 1.0057 1.0187 0.9995 0.9907 0.9883 0.9957 1.0008 0.9923 0.9898 0.9866
dispcorr: -0.033673655 hartree
energy: -1584.392042559693
dipole: 46.89743 -46.47985 0.41758 -25.06175 22.99839 -2.06336 -27.61254 27.06126 -0.55128
magnitude: 2.17618 au
magnitude: 5.53141 debye
