program: Gaussian 09
title: 000054508
version: EM64L-G09RevD.01
frameworkgroup: C1[X(C20H32N2O3)]
method: RPBEPBE
basis: SDD
operation: Freq
keyword: #p
keyword: freq=noraman
keyword: PBEPBE/SDD
title: #p freq=noraman PBEPBE/SDD
converged: YES YES NO NO
title: Mulliken charges:
elementType: O O O N N C C C C C C C C C C C C C C C C C C C C H H H H H H H H H H H H H H H H H H H H H H H H H H H H H H H H
charge: -0.313084 -0.318724 -0.277765 -0.080469 -0.468139 -0.369650 -0.362472 -0.386434 -0.392422 -0.398648 -0.356934 -0.262056 -0.389462 -0.342564 0.234911 -0.247767 -0.351063 0.302901 0.267199 -0.402528 -0.692858 -0.416556 -0.344655 -0.256283 -0.228930 0.211862 0.166296 0.173126 0.209749 0.191545 0.205574 0.207731 0.192479 0.214831 0.188337 0.214849 0.196452 0.228670 0.236108 0.213740 0.211788 0.185966 0.185796 0.196372 0.190876 0.197287 0.198301 0.216409 0.212604 0.390232 0.210131 0.209641 0.218484 0.227667 0.297294 0.227305 0.226948
chargesum: 0.00000
title: Mulliken charges with hydrogens summed into heavy atoms:
elementType: O O O N N C C C C C C C C C C C C C C C C C C C C
charge: -0.313084 -0.318724 -0.277765 -0.080469 -0.077907 0.008508 0.020402 0.010686 0.007788 0.004521 0.054367 0.202722 0.036066 0.029198 0.234911 0.139481 0.044526 0.302901 0.267199 0.026485 -0.054603 -0.188889 -0.047360 -0.028978 -0.001982
polarizability: 3.28733899e+02 -2.06194461e+01 2.57502812e+02 4.78288326e+00 -1.43150292e+01 1.63524183e+02
1716.lowfreq: -28.8572 -13.4584 -6.4355 -4.6103 -0.0007 0.0007 0.0008 6.1789 14.6431
frequency: -28.0327 -2.2898 13.7389 21.6823 31.5248 43.4648 53.1454 64.3180 74.8760 78.6635 101.7780 106.2178 110.9135 129.5126 139.2169 152.8935 168.2576 175.0201 199.3959 218.6434 223.7492 227.2607 241.4458 271.0041 285.1598 309.2394 331.5984 351.0119 374.4692 398.6893 408.3710 418.5050 439.6583 447.6756 465.7389 506.4339 543.3501 556.3182 604.0277 613.0419 694.0819 696.7644 727.3722 731.5786 757.0519 762.9960 769.4129 791.9636 802.8440 805.7922 847.2542 848.6064 851.6545 854.4433 874.7888 884.3154 896.4748 904.3210 919.4362 926.3106 947.9362 954.7956 965.1463 988.9698 991.1459 994.0224 1007.5811 1008.8863 1022.8400 1045.1184 1047.8369 1050.5011 1066.9082 1072.8973 1087.9518 1100.9413 1108.6555 1115.8947 1124.9287 1125.6432 1148.1913 1149.7292 1159.1726 1173.8960 1176.4384 1181.6164 1195.2544 1201.8343 1208.0700 1243.7260 1247.8091 1257.1485 1258.3824 1264.5649 1272.7761 1282.2139 1283.7104 1290.4276 1292.5622 1309.6866 1312.5673 1319.0182 1329.6279 1338.0760 1340.6799 1345.4531 1352.4505 1353.5054 1370.5237 1383.0410 1390.7967 1396.1218 1397.3327 1448.1972 1448.4627 1457.3097 1459.2068 1462.7402 1464.7706 1467.4772 1470.5737 1470.9366 1476.4640 1476.8719 1477.9397 1479.5693 1485.9268 1486.2041 1492.1977 1541.4154 1603.3444 1620.8495 1659.4609 2816.5297 2826.6088 2886.5143 2911.3693 2923.7276 2956.0970 2965.0535 2970.6758 2973.6302 2977.4943 2985.4617 2986.8034 2987.3918 2996.7609 2997.2702 3016.6522 3023.0049 3025.1320 3031.8061 3036.6564 3037.4718 3046.6847 3055.1699 3055.5857 3070.2354 3074.0821 3088.0994 3118.8047 3136.3042 3160.7843 3185.1325 3283.9614
redmass: 2.7454 4.0529 4.4054 4.0419 3.7450 1.6634 4.0033 4.4418 3.9033 4.5310 2.7636 2.5654 2.4211 2.6514 3.1742 4.1040 2.8683 4.2599 4.5499 3.0144 2.4527 1.1173 3.1023 4.5645 4.1290 2.3759 3.9686 3.9915 2.0563 3.2974 3.9547 3.3111 3.1013 2.8700 3.1000 3.5574 3.5392 1.9997 5.5537 5.8277 9.1038 7.2792 3.5037 1.0704 3.3159 1.3346 1.1069 1.3365 1.3489 4.0339 2.2455 1.7766 1.2874 2.7194 1.6757 1.8744 1.5405 2.1493 3.6834 3.1374 1.4340 1.3091 1.1789 1.5264 1.4973 2.5911 5.8348 5.2695 4.7562 2.0279 2.1585 1.8797 2.4035 2.6634 2.8130 1.6093 2.0180 2.0650 2.5995 2.0531 1.4257 1.3095 2.4254 1.1871 1.5234 1.7644 1.3354 1.6635 1.4668 1.6576 1.2815 1.2392 1.2455 1.1789 1.5214 1.0742 1.2281 1.1119 1.3909 1.6919 1.3800 1.4367 1.3149 1.4205 1.3701 1.5031 1.4609 1.5684 1.4366 4.0995 1.2284 1.6484 1.4716 2.5965 1.0975 1.0871 1.0866 1.0878 1.1159 1.0677 1.0799 1.0855 1.2979 1.0679 1.1136 1.4345 1.1293 1.0903 1.1124 2.2566 4.2792 5.1356 7.8543 1.0715 1.0700 1.0697 1.0632 1.0567 1.0586 1.0628 1.0591 1.0367 1.1024 1.0616 1.0608 1.0621 1.0980 1.0970 1.0584 1.0878 1.1031 1.0918 1.0889 1.0904 1.1034 1.1043 1.1037 1.1010 1.0992 1.1085 1.0878 1.0893 1.0977 1.0955 1.0800
irintensity: 0.1765 0.0062 0.6090 0.0219 0.3539 0.1025 0.2615 1.5520 0.2884 0.5631 0.4031 0.6104 1.7733 0.3295 1.6322 0.7263 10.3792 8.2691 1.2768 0.8718 1.6655 0.0256 4.6304 7.0275 5.7241 9.6516 0.0623 4.9089 5.4301 10.1450 1.3739 4.7027 6.4354 0.3480 3.5701 4.8747 2.9967 0.8337 3.9623 1.6537 5.8678 24.1102 6.9255 10.0047 1.6008 85.6698 0.3272 0.8244 0.0986 4.0397 25.0901 3.4080 2.3104 3.6072 2.2482 16.6413 47.4887 13.1081 24.7126 7.7492 7.2879 2.8192 2.3768 6.2173 9.4780 5.1929 185.2395 213.5624 74.8809 38.9928 0.4162 25.2824 17.1109 13.9257 17.6377 27.8168 43.4924 17.3930 0.9249 3.6087 5.3258 5.8552 61.9090 58.9085 206.0386 214.5250 10.3500 7.3603 13.7839 8.0959 3.5453 0.1967 1.8152 4.3249 16.2282 0.4238 12.1383 0.6068 8.8829 60.2479 33.7398 6.2663 1.5008 0.2721 46.4543 4.5650 0.7594 7.4030 2.4063 54.4451 12.9078 7.3049 0.1890 116.2965 6.8933 13.3374 7.0972 7.0022 12.4068 0.3203 3.7254 3.6356 22.8477 6.6094 7.0268 8.3005 21.6736 7.1429 13.8182 386.5306 251.8655 14.2485 224.3632 45.0778 141.5548 106.4762 31.8057 77.7646 16.8973 39.6153 49.2872 37.4586 37.5485 32.3406 39.0219 48.0413 0.6377 42.2651 30.4843 47.2943 12.1137 69.4762 46.3647 8.8854 19.0671 41.6418 101.7051 105.3765 48.5328 36.3000 9.5110 16.5125 30.6082 7.0573 448.6072
temp: 298.150 k
press: 1.00000 atm
elementType: 8 8 8 7 7 6 6 6 6 6 6 6 6 6 6 6 6 6 6 6 6 6 6 6 6 1 1 1 1 1 1 1 1 1 1 1 1 1 1 1 1 1 1 1 1 1 1 1 1 1 1 1 1 1 1 1 1
symmnumber: 1
zpe: 1291125.6 jmol-1
zpe.correction: 0.491764 hartree
zpe.thermalcorrener: 0.516988 hartree
zpe.thermalcorrenthalpy: 0.517932 hartree
zpe.thermalcorrgfe: 0.433644 hartree
zpe.sumelectzpe: -1114.546025 hartree
zpe.sumelectthermal: -1114.520801 hartree
zpe.sumelectthermalent: -1114.519857 hartree
zpe.sumelectthermalfe: -1114.604145 hartree
dipole: -0.4041 4.6921 -0.6079
dipole: 4.7485
quadrupole: -131.9953 -153.0502 -153.5855
quadrupole: 5.9428 -4.9037 -5.3257
quadrupole: 14.2150 -6.8398 -7.3752 5.9428 -4.9037 -5.3257
hfenergy: -1115.0377893 hartree
pointgroup: C01 [X(C20H32N2O3)]
dipole: -0.0196144 1.8432716 0.3036539 debye
polarizability: 324.0914937|27.2716265|261.0842977|2.3817747|17.7813998|164.585103 unknown
InChI: InChI=1S/C20H32N2O3/c1-2-3-9-15-24-17-18-10-5-6-11-19(18)21-20(23)25-16-14-22-12-7-4-8-13-22/h5-6,10-11,21H,2-4,7-9,12-17H2,1H3
charge 0 multiplicity 1
57 atoms
O  0.486727 -0.790488 0.233466
O  -2.934509 1.266787 -0.050943
O  -0.278522 -3.014121 0.085511
N  4.212383 -0.470317 0.20131
N  -1.739037 -1.138354 0.1268
C  5.109587 0.533827 0.828101
C  4.686793 -0.850371 -1.154786
C  6.54798 -0.009919 0.947006
C  6.11181 -1.437179 -1.100762
C  7.088057 -0.439587 -0.436264
C  2.786802 -0.067038 0.218636
C  1.879629 -1.303561 0.271993
C  -1.4506 3.179718 -0.271592
C  -1.045495 4.582321 0.237746
C  -0.518292 -1.780385 0.140654
C  -2.646159 2.606539 0.494554
C  0.172744 5.161889 -0.517444
C  -4.153945 -0.863193 0.185097
C  -3.024412 -1.721197 -0.010915
C  -3.996242 0.554138 0.701331
C  0.584838 6.559372 -0.007412
C  -5.450895 -1.387669 -0.010751
C  -3.220428 -3.085252 -0.350397
C  -5.651277 -2.742623 -0.357547
C  -4.52874 -3.586377 -0.514654
H  4.712923 0.775278 1.831962
H  5.129039 1.489002 0.236978
H  4.681623 0.039966 -1.839998
H  3.990413 -1.594173 -1.582848
H  7.19782 0.765065 1.397506
H  6.541099 -0.882253 1.628756
H  6.087737 -2.377749 -0.517504
H  6.445358 -1.685811 -2.126704
H  8.094542 -0.888319 -0.337675
H  7.194652 0.456077 -1.083468
H  2.599207 0.542803 1.121317
H  2.505616 0.558762 -0.663484
H  2.037363 -1.98429 -0.583213
H  2.039714 -1.87324 1.203698
H  -1.703943 3.226278 -1.348075
H  -0.595783 2.481482 -0.172143
H  -1.902224 5.280863 0.135076
H  -0.810142 4.532241 1.321577
H  -3.544377 3.25055 0.375765
H  -2.417801 2.524264 1.58134
H  1.027272 4.46205 -0.418049
H  -0.06169 5.214768 -1.599948
H  -4.952165 1.10729 0.606262
H  -3.705522 0.545178 1.777694
H  -1.737453 -0.102004 0.100084
H  -0.242106 7.285088 -0.124453
H  0.852959 6.527138 1.065556
H  1.457454 6.950393 -0.561895
H  -6.316088 -0.726458 0.123204
H  -2.349065 -3.732198 -0.473291
H  -6.664839 -3.131374 -0.500267
H  -4.667391 -4.641326 -0.7765
