program: Orca
programVersion: 5.0.2
elementType: F F F O O O O N C C C C C C C C C C C C C C C C C C C C C C C C H H H H H H H H H H H H H H H H H H H H H H H H
charge: 0
multiplicity: 1
keywords: wb97x-d3
keywords: def2-TZVPP
keywords: def2/J RIJCOSX
keywords: DEFGRID2
keywords: scfconv7
keywords: smallprint printgap noloewdin
keywords: NOSOSCF
formula: C24H24F3NO4
InChI: InChI=1/C24H24F3NO4/c1-22(2,3)16-9-11-17(12-10-16)23(15-28,21(30)32-14-13-31-4)20(29)18-7-5-6-8-19(18)24(25,26)27/h5-12H,13-14H2,1-4H3
56 atoms
F  -2.448754 1.613208 -0.780533
F  -2.734927 3.594943 -0.021646
F  -4.042488 2.017913 0.610365
O  -1.585055 -1.249099 -1.660382
O  -2.967504 -0.719248 0.764537
O  -0.960095 -3.314766 -1.03678
O  0.652934 -1.581013 -3.397373
N  -0.838973 -3.377213 2.325818
C  4.670559 0.654647 -0.272837
C  3.259501 0.116743 -0.06988
C  4.681942 1.962504 -1.062662
C  5.322473 0.910385 1.091206
C  5.492667 -0.385216 -1.04389
C  -0.732347 -1.501517 0.517789
C  0.672085 -0.935945 0.339402
C  3.054808 -1.049752 0.668215
C  2.131782 0.734239 -0.604012
C  1.788044 -1.571507 0.870424
C  0.859694 0.218636 -0.409503
C  -1.813778 -0.472501 0.978277
C  -1.125344 -2.146077 -0.826994
C  -1.372692 0.725891 1.744782
C  -0.770051 -2.563978 1.517946
C  -1.850352 2.014323 1.47562
C  -0.513629 0.528734 2.820895
C  -1.462882 3.070197 2.289107
C  -2.769585 2.304401 0.320939
C  -1.761165 -1.582808 -3.048606
C  -0.151066 1.584053 3.641288
C  -0.624469 2.85607 3.372775
C  -0.575515 -1.061423 -3.832563
C  0.942461 -2.87113 -3.884055
H  4.272481 1.843574 -2.067766
H  4.120777 2.753052 -0.560441
H  5.708771 2.315278 -1.173827
H  6.335204 1.297709 0.959837
H  5.398417 0.00236 1.691108
H  4.759538 1.64566 1.669773
H  5.049775 -0.59679 -2.019166
H  5.571215 -1.329263 -0.502365
H  6.507927 -0.019229 -1.2122
H  3.896823 -1.575995 1.100483
H  2.22282 1.639148 -1.188178
H  1.688077 -2.479087 1.452174
H  0.022973 0.744897 -0.846839
H  -0.136889 -0.459341 3.049922
H  -1.808552 4.075081 2.090816
H  -2.667111 -1.069814 -3.369457
H  -1.916388 -2.654225 -3.172446
H  0.503715 1.407328 4.483729
H  -0.33991 3.690256 3.999933
H  -0.758721 -1.270021 -4.895596
H  -0.519862 0.024571 -3.724129
H  1.921724 -3.154767 -3.498519
H  0.221607 -3.628112 -3.560424
H  0.984259 -2.890468 -4.979108
elementType: F O N C H
totalener: -1584.35602292 hartree
nucrepener: 3497.00886894 hartree
electener: -5081.36489186 hartree
oneelecener: -9124.53588768 hartree
twoeener: 4043.17099582 hartree
cpcmener: -0.03930138 hartree
kineticenergy: 1577.90375236 hartree
xcener: -146.962058053148 hartree
chargesum: 0.0000000
charge: -0.174240 -0.177016 -0.170500 -0.251837 -0.315506 -0.398625 -0.378215 -0.042486 0.319993 -0.117309 -0.360447 -0.326890 -0.327623 0.786429 -0.151340 -0.134676 -0.101364 -0.205337 -0.317626 0.160007 0.327268 0.103195 -0.347306 -0.212076 -0.129831 -0.065347 0.535127 -0.031577 -0.131427 -0.139238 0.039479 -0.110028 0.101551 0.103615 0.100778 0.097535 0.097516 0.102349 0.103836 0.098182 0.097326 0.142185 0.145451 0.137567 0.145935 0.152878 0.147415 0.119710 0.117121 0.162537 0.164652 0.101535 0.100587 0.115014 0.091174 0.099918
qa: -0.1742 -0.1770 -0.1705 -0.2518 -0.3155 -0.3986 -0.3782 -0.0425 0.3200 -0.1173 -0.3604 -0.3269 -0.3276 0.7864 -0.1513 -0.1347 -0.1014 -0.2053 -0.3176 0.1600 0.3273 0.1032 -0.3473 -0.2121 -0.1298 -0.0653 0.5351 -0.0316 -0.1314 -0.1392 0.0395 -0.1100 0.1016 0.1036 0.1008 0.0975 0.0975 0.1023 0.1038 0.0982 0.0973 0.1422 0.1455 0.1376 0.1459 0.1529 0.1474 0.1197 0.1171 0.1625 0.1647 0.1015 0.1006 0.1150 0.0912 0.0999
va: 1.1180 1.1247 1.1231 2.1799 2.1569 2.1103 1.9120 3.1087 3.6493 3.8047 3.9267 3.9182 3.9207 3.1246 3.5807 4.0001 3.9474 4.0326 4.0558 3.9068 4.3345 3.4704 4.1237 3.8921 3.8545 3.8900 4.4369 3.8318 3.9492 3.9154 3.8881 3.8956 1.0004 1.0004 1.0070 1.0035 1.0041 1.0034 1.0036 1.0036 1.0033 1.0031 0.9971 1.0149 1.0196 0.9984 1.0069 1.0072 1.0069 0.9904 0.9881 1.0060 1.0004 0.9915 0.9897 0.9939
dispcorr: -0.034408421 hartree
energy: -1584.390431345643
dipole: 56.57222 -54.33720 2.23502 -6.47657 9.04633 2.56976 -15.44050 14.55259 -0.88791
magnitude: 3.51957 au
magnitude: 8.94603 debye
