program: Orca
programVersion: 5.0.2
elementType: F F F O O O O N C C C C C C C C C C C C C C C C C C C C C C C C H H H H H H H H H H H H H H H H H H H H H H H H
charge: 0
multiplicity: 1
keywords: wb97x-d3
keywords: def2-TZVPP
keywords: def2/J RIJCOSX
keywords: DEFGRID2
keywords: scfconv7
keywords: smallprint printgap noloewdin
keywords: NOSOSCF
formula: C24H24F3NO4
InChI: InChI=1/C24H24F3NO4/c1-22(2,3)16-9-11-17(12-10-16)23(15-28,21(30)32-14-13-31-4)20(29)18-7-5-6-8-19(18)24(25,26)27/h5-12H,13-14H2,1-4H3
56 atoms
F  -3.309175 2.608889 -1.06687
F  -1.313174 1.840861 -0.919692
F  -2.109706 3.101942 0.638973
O  -0.45081 -1.029801 -1.278568
O  -0.178319 1.179388 1.678917
O  -0.410256 -3.029793 -0.257366
O  -3.000387 -0.421067 -2.512683
N  0.356925 -2.531241 3.054332
C  5.811923 0.559469 -0.446529
C  4.375959 0.165636 -0.122657
C  6.497168 -0.588157 -1.199292
C  5.886586 1.814803 -1.315229
C  6.563861 0.836584 0.862412
C  0.320928 -1.039215 0.913113
C  1.741325 -0.59021 0.568904
C  4.12207 -0.956356 0.662695
C  3.27068 0.884526 -0.566884
C  2.834948 -1.329301 1.005318
C  1.975844 0.516638 -0.235813
C  -0.629534 0.159448 1.255764
C  -0.234449 -1.84783 -0.265358
C  -2.107434 -0.050293 1.108406
C  0.344318 -1.894341 2.097802
C  -2.942008 0.904271 0.510466
C  -2.683296 -1.171577 1.697038
C  -4.316621 0.738885 0.56596
C  -2.406696 2.117086 -0.207388
C  -0.927902 -1.576981 -2.508635
C  -4.059859 -1.329183 1.742433
C  -4.878608 -0.364788 1.189125
C  -2.432003 -1.695803 -2.541051
C  -4.393609 -0.445631 -2.630262
H  6.522015 -1.507649 -0.61386
H  5.983166 -0.807582 -2.136168
H  7.529709 -0.325035 -1.437346
H  5.390807 1.678722 -2.27794
H  6.929625 2.059168 -1.520922
H  5.442806 2.6816 -0.822777
H  7.594294 1.131727 0.65482
H  6.599018 -0.040136 1.509623
H  6.090115 1.642345 1.424506
H  4.941992 -1.558929 1.03286
H  3.400483 1.762988 -1.18289
H  2.697975 -2.204002 1.627316
H  1.162136 1.117053 -0.612949
H  -2.067615 -1.922275 2.170343
H  -4.969466 1.471708 0.114326
H  -0.477247 -2.553516 -2.690984
H  -0.588005 -0.88546 -3.278409
H  -4.48084 -2.200746 2.224511
H  -5.95453 -0.466792 1.231665
H  -2.694145 -2.23089 -3.467916
H  -2.787677 -2.31971 -1.70854
H  -4.870107 -0.996206 -1.80969
H  -4.747467 0.583578 -2.605323
H  -4.719739 -0.899635 -3.575246
totalener: -1584.33132145 hartree
nucrepener: 3479.42526787 hartree
electener: -5063.75658932 hartree
oneelecener: -9088.47201605 hartree
twoeener: 4024.71542673 hartree
kineticenergy: 1577.96406070 hartree
xcener: -146.966162254923 hartree
chargesum: 0.0000000
charge: -0.180137 -0.167387 -0.153309 -0.241223 -0.223222 -0.301690 -0.305109 0.011245 0.242664 -0.065111 -0.291364 -0.335781 -0.289034 0.672716 -0.121455 -0.134038 -0.134469 -0.188213 -0.130752 0.073284 0.190519 0.157653 -0.316058 -0.249980 -0.164494 -0.072060 0.554629 -0.027695 -0.089390 -0.161911 0.011928 -0.127558 0.088909 0.098408 0.088115 0.094132 0.091376 0.098272 0.086852 0.088602 0.103539 0.109156 0.120413 0.127276 0.122498 0.153791 0.131971 0.105618 0.108991 0.138191 0.137959 0.079697 0.093505 0.081363 0.106078 0.102089
qa: -0.1801 -0.1674 -0.1533 -0.2412 -0.2232 -0.3017 -0.3051 0.0112 0.2427 -0.0651 -0.2914 -0.3358 -0.2890 0.6727 -0.1215 -0.1340 -0.1345 -0.1882 -0.1308 0.0733 0.1905 0.1577 -0.3161 -0.2500 -0.1645 -0.0721 0.5546 -0.0277 -0.0894 -0.1619 0.0119 -0.1276 0.0889 0.0984 0.0881 0.0941 0.0914 0.0983 0.0869 0.0886 0.1035 0.1092 0.1204 0.1273 0.1225 0.1538 0.1320 0.1056 0.1090 0.1382 0.1380 0.0797 0.0935 0.0814 0.1061 0.1021
va: 1.1194 1.1328 1.1493 2.1826 2.2370 2.1892 1.9682 3.1018 3.7786 3.7753 3.9225 3.9310 3.9225 3.2140 3.8346 4.0697 3.9984 4.1077 4.0851 3.9833 4.4130 3.3269 4.0475 3.9144 3.9553 3.8057 4.4095 3.9262 3.9706 3.9313 3.9008 3.9244 1.0078 1.0061 1.0062 1.0027 1.0115 1.0024 1.0061 1.0075 1.0057 1.0133 1.0046 1.0181 1.0255 1.0213 1.0141 1.0142 1.0069 0.9977 0.9979 1.0039 0.9985 0.9849 0.9962 0.9982
dispcorr: -0.035196483 hartree
energy: -1584.366517932811
dipole: 36.77099 -37.71939 -0.94841 -12.28319 12.01096 -0.27223 -14.85155 13.15289 -1.69866
magnitude: 1.96444 au
magnitude: 4.99321 debye
