program: Gaussian 09
title: 000054480
version: EM64L-G09RevD.01
frameworkgroup: C1[X(C19H14O2)]
method: RPBEPBE
basis: SDD
operation: Freq
keyword: #pfreq=noraman
keyword: PBEPBE/SDD
title: #p freq=noraman PBEPBE/SDD
converged: YES YES NO NO
title: Mulliken charges:
elementType: O O C C C C C C C C C C C C C C C C C C C H H H H H H H H H H H H H H
charge: -0.435236 -0.432093 0.322958 0.293288 0.055391 0.275638 0.129759 0.505066 -0.780360 0.493199 -0.449685 -0.515047 -0.822300 -0.543280 -0.322470 -0.452287 -0.629120 0.284456 -0.414294 -0.397687 0.292521 0.230478 0.234273 0.229443 0.237501 0.240558 0.230442 0.251869 0.223203 0.246612 0.233508 0.222183 0.251941 0.354894 0.354679
chargesum: 0.00000
title: Mulliken charges with hydrogens summed into heavy atoms:
elementType: O O C C C C C C C C C C C C C C C C C C C
charge: -0.080342 -0.077414 0.322958 0.293288 0.055391 0.275638 0.129759 0.505066 -0.549882 0.493199 -0.215412 -0.285605 -0.113799 -0.291411 -0.099267 -0.205675 -0.395612 0.284456 -0.192111 -0.145747 0.292521
polarizability: 4.45034968e+02 1.25203332e+01 2.33120200e+02 -2.00543320e-01 1.36187411e+00 8.49162572e+01
1716.lowfreq: -76.4297 -7.2673 -5.7720 -0.0007 -0.0004 0.0003 5.8232 42.7183 60.8787
frequency: -76.4194 42.7165 60.8779 88.3186 130.0861 148.0895 173.9433 194.0228 241.2277 277.4124 280.2348 310.8618 316.9183 338.5162 364.6726 385.5923 389.9291 404.8251 421.1289 434.6226 470.1406 482.0769 511.2180 518.0721 532.6004 549.3397 553.4569 594.1932 603.4792 630.6608 667.5209 700.6062 722.3288 757.2283 767.3192 785.4059 798.3587 800.1963 818.3076 826.7305 842.9547 869.8966 873.6647 909.9153 911.3061 937.5906 947.6365 951.1018 957.9625 978.1471 1037.3956 1041.7163 1067.3637 1109.4262 1129.9272 1154.6956 1156.1346 1170.4009 1192.4304 1205.9429 1226.5100 1251.0740 1254.1879 1272.1324 1301.0052 1325.6183 1336.1891 1376.5670 1393.7380 1397.8557 1405.9274 1414.8376 1434.1629 1454.0039 1464.9812 1470.2777 1479.7587 1510.5248 1517.1129 1558.2221 1578.5973 1596.6186 1620.8119 1627.4647 1646.3485 2978.7331 3066.4877 3102.9896 3108.1644 3113.1578 3121.8087 3137.0069 3141.0118 3151.3597 3165.7255 3174.6253 3178.6480 3581.1600 3586.9770
redmass: 1.1013 6.6166 3.7611 5.0304 6.2918 3.6304 4.0954 5.4874 6.4845 5.3100 4.1639 1.5430 2.2610 3.4752 1.1408 3.8942 4.9594 3.9840 3.6026 3.0152 4.4289 5.7418 2.7904 5.0005 5.7078 5.5890 2.9108 3.7263 5.9956 3.5936 6.6768 3.0328 6.5967 4.7130 2.0063 1.4657 1.7183 5.2067 1.7216 4.8938 1.9115 1.7082 1.8603 2.2683 3.5656 2.5120 3.8508 1.5564 1.3670 1.3789 1.6789 3.2835 1.8017 2.1806 1.6469 1.3163 1.4323 1.3634 1.3256 1.9505 1.5567 1.5903 1.8997 2.1900 2.4136 3.1178 2.9888 3.0534 2.9835 1.2627 3.2273 3.4450 5.5558 4.9355 1.6484 1.6099 2.3944 1.4465 2.7497 6.0412 7.0655 5.8193 6.7139 6.5364 6.4118 1.0448 1.0903 1.0968 1.0915 1.0869 1.0885 1.0914 1.0964 1.0866 1.0939 1.0964 1.0903 1.0660 1.0661
irintensity: 1.0493 0.1247 1.4648 0.5760 1.7348 4.4410 0.1555 0.5096 1.4051 1.1620 0.3328 116.2393 22.1395 10.1851 153.5661 0.5360 3.6488 2.4850 4.7266 0.4300 21.2023 14.6175 23.2399 9.9920 5.0222 0.0116 0.2293 5.5268 2.2904 8.5005 0.3117 7.9817 4.7245 8.3444 3.0486 6.8863 20.2480 24.5957 9.3915 13.4835 40.6538 0.1159 88.5012 11.9672 5.5508 36.9619 46.4844 7.6821 1.1943 1.0890 5.3120 0.6342 1.3577 66.1659 346.2952 190.6351 10.8959 133.9881 18.7460 18.1804 0.1186 17.6079 29.8865 11.1216 48.8247 3.4292 39.5019 3.5831 5.2324 16.0150 1.7535 29.8449 5.1787 10.5238 9.0216 29.5182 35.2833 14.7501 140.8773 0.6484 13.4801 44.3113 54.0483 26.2609 152.7537 34.1682 21.5452 13.1001 24.9260 11.0574 11.1853 5.3123 21.6164 9.4110 25.3267 11.3350 9.3719 67.8304 70.2804
temp: 298.150 k
press: 1.00000 atm
elementType: 8 8 6 6 6 6 6 6 6 6 6 6 6 6 6 6 6 6 6 6 6 1 1 1 1 1 1 1 1 1 1 1 1 1 1
symmnumber: 1
zpe: 712144.3 jmol-1
zpe.correction: 0.271241 hartree
zpe.thermalcorrener: 0.287209 hartree
zpe.thermalcorrenthalpy: 0.288154 hartree
zpe.thermalcorrgfe: 0.228571 hartree
zpe.sumelectzpe: -881.472076 hartree
zpe.sumelectthermal: -881.456108 hartree
zpe.sumelectthermalent: -881.455164 hartree
zpe.sumelectthermalfe: -881.514746 hartree
dipole: -0.1596 0.0631 0.1248
dipole: 0.2122
quadrupole: -103.2375 -103.4938 -129.7780
quadrupole: 22.0228 0.0762 0.2840
quadrupole: 8.9323 8.6759 -17.6082 22.0228 0.0762 0.2840
hfenergy: -881.7433178 hartree
pointgroup: C01 [X(C19H14O2)]
dipole: -0.0625792 -0.025224 -0.0491631 debye
polarizability: 445.1905236|-11.1215631|232.9642068|0.4607307|1.3521912|84.9166951 unknown
InChI: InChI=1S/C19H14O2/c1-11-16-6-3-12-8-14(20)5-7-17(12)19(16)9-13-2-4-15(21)10-18(11)13/h2-10,20-21H,1H3
charge 0 multiplicity 1
35 atoms
O  -6.058633 0.299808 -0.071154
O  6.127534 0.960744 -0.017575
C  0.453708 0.108822 0.019476
C  -0.073445 -1.252836 0.016014
C  -1.47916 -1.499766 0.037523
C  -2.396501 -0.394141 0.017527
C  1.908627 0.32959 0.011046
C  -1.864043 0.962282 0.019631
C  -0.462807 1.176548 0.030261
C  2.799066 -0.799535 -0.020504
C  0.87999 -2.348942 -0.025138
C  2.241769 -2.136122 -0.04494
C  -2.006841 -2.926648 0.068101
C  -3.824353 -0.559142 -0.017418
C  2.498081 1.631078 0.032031
C  -2.774936 2.073992 0.009198
C  4.211635 -0.605845 -0.031029
C  -4.672294 0.545994 -0.033369
C  -4.15159 1.883686 -0.014692
C  3.884778 1.81907 0.022668
C  4.747794 0.690274 -0.009502
H  -0.110299 2.212909 0.036334
H  0.506621 -3.376014 -0.057157
H  2.932074 -2.987659 -0.081383
H  -3.020992 -2.977832 0.492612
H  -2.051309 -3.366355 -0.948078
H  -1.37379 -3.584987 0.685677
H  -4.282935 -1.549718 -0.046693
H  1.862718 2.521029 0.058057
H  -2.363178 3.089747 0.017715
H  4.869663 -1.484997 -0.055904
H  -4.836224 2.741782 -0.023363
H  4.327157 2.819151 0.039942
H  -6.566369 1.148287 -0.087276
H  6.651087 0.121547 -0.040339
