program: Orca
programVersion: 5.0.2
elementType: F F F O O O O N C C C C C C C C C C C C C C C C C C C C C C C C H H H H H H H H H H H H H H H H H H H H H H H H
charge: 0
multiplicity: 1
keywords: wb97x-d3
keywords: def2-TZVPP
keywords: def2/J RIJCOSX
keywords: DEFGRID2
keywords: scfconv7
keywords: smallprint printgap noloewdin
keywords: NOSOSCF
formula: C24H24F3NO4
InChI: InChI=1/C24H24F3NO4/c1-22(2,3)16-9-11-17(12-10-16)23(15-28,21(30)32-14-13-31-4)20(29)18-7-5-6-8-19(18)24(25,26)27/h5-12H,13-14H2,1-4H3
56 atoms
F  -4.734372 0.386225 2.181463
F  -3.47746 -0.754923 0.863444
F  -4.195031 1.183101 0.259275
O  0.06759 -1.896719 -2.078947
O  -1.50671 0.560218 -0.991718
O  -1.742918 -2.654075 -0.997888
O  -0.519706 -0.196364 -4.249033
N  -0.907526 -2.389352 2.343753
C  5.389932 0.435866 0.222316
C  3.923613 0.025283 0.168095
C  5.771375 1.376568 -0.92059
C  5.667819 1.153834 1.549548
C  6.266875 -0.81901 0.125125
C  -0.268384 -1.146543 0.142172
C  1.211958 -0.77302 0.138385
C  3.044926 0.468271 -0.81631
C  3.405284 -0.835882 1.132922
C  1.714655 0.079351 -0.839013
C  2.077951 -1.226953 1.125968
C  -1.083617 0.176904 0.059672
C  -0.738468 -2.009321 -1.046653
C  -1.257547 0.952763 1.329809
C  -0.639032 -1.849227 1.366576
C  -2.519013 1.122828 1.904681
C  -0.151546 1.555413 1.917073
C  -2.654698 1.896205 3.047537
C  -3.737294 0.480998 1.298409
C  -0.389108 -2.378882 -3.344243
C  -0.298973 2.335457 3.053334
C  -1.549233 2.506043 3.61872
C  -1.268076 -1.353432 -4.020848
C  -1.301447 0.884774 -4.672978
H  5.623256 0.915401 -1.898417
H  5.203383 2.308103 -0.894187
H  6.827156 1.639944 -0.844819
H  5.049509 2.046828 1.651248
H  6.713458 1.462932 1.603558
H  5.472116 0.515405 2.411666
H  6.088948 -1.351783 -0.809992
H  6.078993 -1.516145 0.942082
H  7.324208 -0.549172 0.161616
H  3.387594 1.13241 -1.597117
H  4.042929 -1.216309 1.921016
H  1.083472 0.443738 -1.638621
H  1.724397 -1.886308 1.907374
H  0.829048 1.432406 1.479981
H  -3.624545 2.023884 3.506472
H  -0.92555 -3.322344 -3.234102
H  0.515365 -2.554766 -3.924971
H  0.568955 2.806981 3.493667
H  -1.669481 3.108511 4.508604
H  -1.636479 -1.791676 -4.962088
H  -2.152692 -1.149244 -3.402324
H  -2.060969 1.157912 -3.93124
H  -0.638923 1.737337 -4.816545
H  -1.810179 0.683313 -5.624849
totalener: -1584.33235621 hartree
nucrepener: 3439.67173521 hartree
electener: -5024.00409141 hartree
oneelecener: -9009.24766368 hartree
twoeener: 3985.24357226 hartree
kineticenergy: 1577.97327672 hartree
xcener: -146.967106491970 hartree
chargesum: 0.0000000
charge: -0.170177 -0.152167 -0.159040 -0.228612 -0.268186 -0.312607 -0.318711 0.022987 0.255997 -0.106392 -0.337316 -0.293713 -0.290250 0.707945 -0.222707 -0.107653 -0.096022 -0.143871 -0.212208 0.159626 0.301029 0.086283 -0.403724 -0.206383 -0.163784 -0.051655 0.535686 -0.020238 -0.103119 -0.127651 0.001439 -0.112661 0.097929 0.095472 0.093220 0.096242 0.090116 0.089984 0.101532 0.089337 0.089029 0.124563 0.114003 0.128116 0.128906 0.134171 0.132274 0.104243 0.102994 0.129968 0.133384 0.081599 0.098278 0.093061 0.102909 0.086524
qa: -0.1702 -0.1522 -0.1590 -0.2286 -0.2682 -0.3126 -0.3187 0.0230 0.2560 -0.1064 -0.3373 -0.2937 -0.2902 0.7079 -0.2227 -0.1077 -0.0960 -0.1439 -0.2122 0.1596 0.3010 0.0863 -0.4037 -0.2064 -0.1638 -0.0517 0.5357 -0.0202 -0.1031 -0.1277 0.0014 -0.1127 0.0979 0.0955 0.0932 0.0962 0.0901 0.0900 0.1015 0.0893 0.0890 0.1246 0.1140 0.1281 0.1289 0.1342 0.1323 0.1042 0.1030 0.1300 0.1334 0.0816 0.0983 0.0931 0.1029 0.0865
va: 1.1359 1.1521 1.1431 2.1972 2.1782 2.1854 1.9586 3.1152 3.7687 3.8034 3.9340 3.9230 3.9231 3.2907 3.7976 3.9479 4.0328 4.0321 4.0819 3.9010 4.2772 3.5281 4.0771 3.9900 3.9835 3.9192 4.4522 3.9128 3.9903 3.9640 3.9364 3.9213 1.0024 1.0023 1.0114 1.0071 1.0067 1.0072 1.0058 1.0077 1.0061 1.0028 1.0114 1.0383 1.0287 1.0095 1.0140 1.0147 1.0051 1.0014 1.0001 1.0021 0.9986 0.9942 0.9947 0.9915
dispcorr: -0.033138570 hartree
energy: -1584.365494776735
dipole: 60.56887 -58.68337 1.88550 8.52323 -7.08477 1.43846 -17.49215 17.01703 -0.47512
magnitude: 2.41868 au
magnitude: 6.14779 debye
