program: Orca
programVersion: 5.0.2
elementType: F F F O O O O N C C C C C C C C C C C C C C C C C C C C C C C C H H H H H H H H H H H H H H H H H H H H H H H H
charge: 0
multiplicity: 1
keywords: wb97x-d3
keywords: def2-TZVPP
keywords: def2/J RIJCOSX
keywords: DEFGRID2
keywords: scfconv7
keywords: smallprint printgap noloewdin
keywords: NOSOSCF
formula: C24H24F3NO4
InChI: InChI=1/C24H24F3NO4/c1-22(2,3)16-9-11-17(12-10-16)23(15-28,21(30)32-14-13-31-4)20(29)18-7-5-6-8-19(18)24(25,26)27/h5-12H,13-14H2,1-4H3
56 atoms
F  -2.549749 3.955844 0.229978
F  -4.007886 2.43416 0.627199
F  -2.407582 2.067877 -0.771303
O  -1.181762 -2.959752 -1.524302
O  -3.169636 -0.415585 0.464619
O  -1.764249 -0.857804 -2.08002
O  0.913153 -2.17853 -3.153396
N  -1.207861 -3.362786 1.755508
C  4.518774 0.693353 -0.132523
C  3.085594 0.177703 -0.082792
C  5.379789 -0.290066 -0.935804
C  4.617336 2.06874 -0.792789
C  5.069143 0.807469 1.295154
C  -0.987362 -1.322546 0.14647
C  0.45107 -0.823808 0.071677
C  2.80406 -1.04372 0.526543
C  2.011218 0.870539 -0.632655
C  1.514251 -1.540216 0.604381
C  0.717516 0.379523 -0.565787
C  -2.009634 -0.28223 0.712005
C  -1.387338 -1.672871 -1.298835
C  -1.493241 0.776515 1.633393
C  -1.107007 -2.487465 1.017406
C  -1.852677 2.123249 1.52286
C  -0.684979 0.373801 2.691262
C  -1.396049 3.030223 2.469907
C  -2.713578 2.637643 0.39683
C  -1.075804 -3.407579 -2.875754
C  -0.249534 1.281342 3.640547
C  -0.603617 2.613532 3.527155
C  0.3897 -3.467378 -3.242904
C  2.309871 -2.127764 -3.104785
H  5.016272 -0.385932 -1.960225
H  6.414682 0.054792 -0.980407
H  5.386291 -1.286467 -0.492655
H  4.034629 2.821661 -0.259532
H  4.282463 2.052443 -1.831246
H  5.655529 2.403383 -0.79493
H  5.078944 -0.152645 1.811715
H  4.471832 1.497653 1.892379
H  6.095578 1.178936 1.279396
H  3.603916 -1.631338 0.959993
H  2.165255 1.819343 -1.126802
H  1.34655 -2.490183 1.095548
H  -0.080774 0.951494 -1.018177
H  -0.403686 -0.665494 2.794319
H  -1.652487 4.076566 2.388947
H  -1.632333 -2.754752 -3.549091
H  -1.5157 -4.404045 -2.909202
H  0.367233 0.944159 4.462255
H  -0.262309 3.33477 4.257162
H  0.905937 -4.159134 -2.560567
H  0.486027 -3.886384 -4.256422
H  2.713184 -2.707606 -2.265408
H  2.774818 -2.494116 -4.028948
H  2.594104 -1.086483 -2.961315
totalener: -1584.32889113 hartree
nucrepener: 3501.36825880 hartree
electener: -5085.69714992 hartree
oneelecener: -9132.46506070 hartree
twoeener: 4046.76791078 hartree
kineticenergy: 1577.98319417 hartree
xcener: -146.969473949576 hartree
chargesum: -0.0000000
charge: -0.176239 -0.151254 -0.159876 -0.256977 -0.236170 -0.309445 -0.306176 0.024154 0.281246 -0.079519 -0.303796 -0.338870 -0.289924 0.747573 -0.249699 -0.150468 -0.156346 -0.169966 -0.152434 0.145153 0.314686 0.094089 -0.448427 -0.221404 -0.109758 -0.055364 0.527645 -0.008737 -0.116553 -0.122454 0.018369 -0.120538 0.090892 0.094249 0.091767 0.100331 0.094774 0.092868 0.088658 0.099133 0.089268 0.110267 0.123324 0.130876 0.139670 0.136607 0.131622 0.110966 0.106503 0.132977 0.134092 0.074019 0.077830 0.083551 0.102043 0.101189
qa: -0.1762 -0.1513 -0.1599 -0.2570 -0.2362 -0.3094 -0.3062 0.0242 0.2812 -0.0795 -0.3038 -0.3389 -0.2899 0.7476 -0.2497 -0.1505 -0.1563 -0.1700 -0.1524 0.1452 0.3147 0.0941 -0.4484 -0.2214 -0.1098 -0.0554 0.5276 -0.0087 -0.1166 -0.1225 0.0184 -0.1205 0.0909 0.0942 0.0918 0.1003 0.0948 0.0929 0.0887 0.0991 0.0893 0.1103 0.1233 0.1309 0.1397 0.1366 0.1316 0.1110 0.1065 0.1330 0.1341 0.0740 0.0778 0.0836 0.1020 0.1012
va: 1.1232 1.1533 1.1391 2.1672 2.2284 2.1906 1.9817 3.1115 3.7298 3.7313 3.9266 3.9366 3.9197 3.2288 3.7500 4.0325 3.9800 3.9633 4.0868 3.8954 4.3188 3.5423 4.1296 3.9617 3.9045 3.9210 4.4548 3.8983 4.0058 3.9550 3.9369 3.9381 1.0079 1.0091 1.0060 1.0023 1.0016 1.0116 1.0072 1.0065 1.0070 1.0144 1.0051 1.0212 1.0314 1.0116 1.0143 1.0196 1.0003 1.0009 0.9994 0.9954 1.0003 0.9900 0.9912 0.9950
dispcorr: -0.035821924 hartree
energy: -1584.364713050243
dipole: 62.68233 -59.89335 2.78899 -14.32833 14.54189 0.21356 -9.35427 9.38723 0.03296
magnitude: 2.79735 au
magnitude: 7.11029 debye
