program: Orca
programVersion: 5.0.2
elementType: F F F O O O O N C C C C C C C C C C C C C C C C C C C C C C C C H H H H H H H H H H H H H H H H H H H H H H H H
charge: 0
multiplicity: 1
keywords: wb97x-d3
keywords: def2-TZVPP
keywords: def2/J RIJCOSX
keywords: DEFGRID2
keywords: scfconv7
keywords: smallprint printgap noloewdin
keywords: NOSOSCF
formula: C24H24F3NO4
InChI: InChI=1/C24H24F3NO4/c1-22(2,3)16-9-11-17(12-10-16)23(15-28,21(30)32-14-13-31-4)20(29)18-7-5-6-8-19(18)24(25,26)27/h5-12H,13-14H2,1-4H3
56 atoms
F  -0.67479 1.249969 2.320119
F  -1.186563 3.321344 2.071471
F  0.703416 2.600938 1.352612
O  -0.973814 -2.288213 -1.131493
O  -2.673128 -0.976025 1.136576
O  -0.161948 -3.633594 0.468574
O  -3.651877 -2.774313 -1.81826
N  -0.224389 -1.917281 3.391229
C  4.562573 1.567443 -0.771104
C  3.298028 0.814195 -0.380334
C  5.796638 0.716787 -0.445845
C  4.597984 1.903881 -2.261935
C  4.615238 2.878282 0.025195
C  -0.32744 -1.249233 0.872328
C  0.94393 -0.529881 0.433337
C  2.251393 0.58154 -1.264692
C  3.137962 0.342617 0.920861
C  1.09773 -0.07942 -0.873132
C  1.991268 -0.31656 1.322894
C  -1.683391 -0.481266 0.683585
C  -0.469057 -2.555601 0.065823
C  -1.744981 0.74242 -0.178426
C  -0.266438 -1.636536 2.279114
C  -1.218005 1.988122 0.149919
C  -2.404576 0.582724 -1.396022
C  -1.30788 3.038498 -0.755566
C  -0.586593 2.284483 1.477555
C  -1.371483 -3.382134 -1.961506
C  -2.482468 1.630889 -2.295384
C  -1.92224 2.859189 -1.981054
C  -2.766248 -3.834276 -1.599325
C  -4.89409 -2.944639 -1.189073
H  6.707951 1.247937 -0.727202
H  5.872705 0.48536 0.616621
H  5.778397 -0.228858 -0.989221
H  5.526667 2.423863 -2.501077
H  3.777775 2.560816 -2.556303
H  4.557644 1.008249 -2.884377
H  3.744522 3.500665 -0.185745
H  5.509113 3.449848 -0.233022
H  4.637625 2.700438 1.100815
H  2.314379 0.917852 -2.289924
H  3.919925 0.494039 1.654135
H  0.322167 -0.226739 -1.610247
H  1.919935 -0.656806 2.346911
H  -2.838214 -0.376438 -1.645234
H  -0.902379 4.00902 -0.501197
H  -0.667982 -4.211553 -1.880244
H  -1.342375 -2.995955 -2.979875
H  -2.986859 1.487432 -3.241449
H  -1.978781 3.682204 -2.68041
H  -3.018892 -4.708679 -2.217938
H  -2.787927 -4.171595 -0.553838
H  -5.495723 -2.062705 -1.401642
H  -5.429974 -3.825825 -1.562067
H  -4.791301 -3.036133 -0.102263
totalener: -1584.32901636 hartree
nucrepener: 3538.20408952 hartree
electener: -5122.53310589 hartree
oneelecener: -9205.87057610 hartree
twoeener: 4083.33747022 hartree
kineticenergy: 1577.97911381 hartree
xcener: -146.969370700696 hartree
chargesum: -0.0000000
charge: -0.158791 -0.165690 -0.160640 -0.265017 -0.261413 -0.294147 -0.329512 0.025905 0.247712 -0.057888 -0.292620 -0.335862 -0.290968 0.655486 -0.234016 -0.121352 -0.111332 -0.174892 -0.184919 0.150827 0.265507 0.084640 -0.301563 -0.082278 -0.189989 -0.130374 0.547935 -0.038190 -0.138289 -0.109142 0.009105 -0.105004 0.088460 0.089993 0.100884 0.092340 0.090343 0.099619 0.096714 0.088593 0.092489 0.117836 0.110612 0.125518 0.126871 0.143572 0.117220 0.114486 0.106297 0.134526 0.134780 0.086407 0.096689 0.098606 0.092262 0.101651
qa: -0.1588 -0.1657 -0.1606 -0.2650 -0.2614 -0.2941 -0.3295 0.0259 0.2477 -0.0579 -0.2926 -0.3359 -0.2910 0.6555 -0.2340 -0.1214 -0.1113 -0.1749 -0.1849 0.1508 0.2655 0.0846 -0.3016 -0.0823 -0.1900 -0.1304 0.5479 -0.0382 -0.1383 -0.1091 0.0091 -0.1050 0.0885 0.0900 0.1009 0.0923 0.0903 0.0996 0.0967 0.0886 0.0925 0.1178 0.1106 0.1255 0.1269 0.1436 0.1172 0.1145 0.1063 0.1345 0.1348 0.0864 0.0967 0.0986 0.0923 0.1017
va: 1.1471 1.1451 1.1359 2.1388 2.2023 2.2087 1.9561 3.1175 3.7758 3.7780 3.9229 3.9296 3.9267 3.4660 3.6383 3.9884 4.0565 4.0785 4.1219 4.0092 4.3143 3.4478 4.0513 3.7860 3.9534 4.0408 4.4221 3.9056 3.9991 3.9253 3.9202 3.9088 1.0060 1.0084 1.0050 1.0117 1.0029 1.0027 1.0086 1.0060 1.0071 1.0064 1.0129 1.0130 1.0286 1.0299 1.0173 1.0163 1.0040 0.9993 0.9984 1.0026 0.9979 0.9957 0.9903 0.9938
dispcorr: -0.036050175 hartree
energy: -1584.365066536993
dipole: 22.62314 -22.59129 0.03185 -6.09798 6.95033 0.85235 -30.60230 27.50491 -3.09739
magnitude: 3.21268 au
magnitude: 8.16599 debye
