program: Orca
programVersion: 5.0.2
elementType: F F F O O O O N C C C C C C C C C C C C C C C C C C C C C C C C H H H H H H H H H H H H H H H H H H H H H H H H
charge: 0
multiplicity: 1
keywords: wb97x-d3
keywords: def2-TZVPP
keywords: def2/J RIJCOSX
keywords: DEFGRID2
keywords: scfconv7
keywords: smallprint printgap noloewdin
keywords: NOSOSCF
formula: C24H24F3NO4
InChI: InChI=1/C24H24F3NO4/c1-22(2,3)16-9-11-17(12-10-16)23(15-28,21(30)32-14-13-31-4)20(29)18-7-5-6-8-19(18)24(25,26)27/h5-12H,13-14H2,1-4H3
56 atoms
F  -0.836788 3.119108 3.237923
F  0.903167 2.64916 2.073179
F  -0.326496 1.064618 2.863069
O  -0.826832 -3.253438 -0.067883
O  -2.867567 -0.455415 1.992526
O  -2.354608 -1.797094 -0.819146
O  -0.938611 -5.178333 -3.120182
N  -0.252187 -2.411798 3.112546
C  3.782025 1.560002 -1.51118
C  2.62289 0.807213 -0.871249
C  4.149973 0.900959 -2.846557
C  3.349333 3.0126 -1.753401
C  5.026447 1.570811 -0.623802
C  -0.83756 -1.118545 0.92513
C  0.399152 -0.493878 0.288796
C  1.413803 0.67852 -1.556032
C  2.691923 0.240907 0.394674
C  0.324069 0.043245 -0.995259
C  1.602885 -0.401568 0.967456
C  -1.976162 -0.100851 1.284305
C  -1.451534 -2.097268 -0.089811
C  -1.960465 1.250193 0.630347
C  -0.510237 -1.847873 2.146099
C  -1.195654 2.327031 1.0685
C  -2.792547 1.413785 -0.474114
C  -1.238913 3.533907 0.380132
C  -0.358586 2.282888 2.312039
C  -1.24085 -4.270982 -0.986227
C  -2.830108 2.617616 -1.155162
C  -2.042012 3.677761 -0.735715
C  -0.587514 -4.071212 -2.343361
C  -0.436212 -5.118726 -4.424384
H  4.980454 1.430936 -3.316793
H  4.453899 -0.13678 -2.702803
H  3.319319 0.906962 -3.552906
H  4.164298 3.58523 -2.200444
H  3.069264 3.498553 -0.817761
H  2.494267 3.078421 -2.427006
H  4.844369 2.062752 0.332965
H  5.828909 2.118139 -1.120039
H  5.396539 0.563854 -0.424053
H  1.305673 1.091844 -2.55085
H  3.603898 0.297289 0.971726
H  -0.591383 -0.0138 -1.56868
H  1.709042 -0.821299 1.958851
H  -3.398443 0.584132 -0.809833
H  -0.645105 4.372666 0.719182
H  -2.327721 -4.291639 -1.075978
H  -0.907754 -5.206551 -0.54067
H  -3.478695 2.726515 -2.013983
H  -2.063706 4.62012 -1.265698
H  -0.936461 -3.134706 -2.800922
H  0.502662 -3.989069 -2.221564
H  0.660513 -5.090516 -4.446619
H  -0.766473 -6.013729 -4.949162
H  -0.806491 -4.242042 -4.970928
totalener: -1584.32986694 hartree
nucrepener: 3477.15844580 hartree
electener: -5061.48831274 hartree
oneelecener: -9083.31070467 hartree
twoeener: 4021.82239193 hartree
kineticenergy: 1577.96863970 hartree
xcener: -146.966300354905 hartree
chargesum: -0.0000000
charge: -0.162968 -0.169323 -0.163142 -0.248130 -0.235899 -0.353430 -0.318749 0.023838 0.257393 -0.070730 -0.293273 -0.294745 -0.337072 0.689448 -0.169517 -0.124244 -0.081256 -0.293453 -0.165244 0.188479 0.271684 0.155355 -0.392682 -0.127114 -0.201403 -0.136360 0.553583 0.015152 -0.117320 -0.117756 0.018378 -0.113647 0.089649 0.100538 0.086720 0.089770 0.100542 0.086565 0.097992 0.091963 0.098658 0.108363 0.122459 0.134917 0.127217 0.145388 0.119282 0.101418 0.114616 0.136693 0.134059 0.079255 0.073792 0.081681 0.111545 0.081064
qa: -0.1630 -0.1693 -0.1631 -0.2481 -0.2359 -0.3534 -0.3187 0.0238 0.2574 -0.0707 -0.2933 -0.2947 -0.3371 0.6894 -0.1695 -0.1242 -0.0813 -0.2935 -0.1652 0.1885 0.2717 0.1554 -0.3927 -0.1271 -0.2014 -0.1364 0.5536 0.0152 -0.1173 -0.1178 0.0184 -0.1136 0.0896 0.1005 0.0867 0.0898 0.1005 0.0866 0.0980 0.0920 0.0987 0.1084 0.1225 0.1349 0.1272 0.1454 0.1193 0.1014 0.1146 0.1367 0.1341 0.0793 0.0738 0.0817 0.1115 0.0811
va: 1.1479 1.1288 1.1399 2.1899 2.2305 2.1165 1.9882 3.1149 3.7632 3.8043 3.9216 3.9247 3.9325 3.4405 3.6380 4.0804 3.9413 4.1348 4.0457 4.0137 4.2732 3.4988 4.1268 3.8247 3.9820 4.0322 4.4188 3.8653 3.9594 3.9469 3.9290 3.9418 1.0062 1.0060 1.0076 1.0074 1.0084 1.0067 1.0019 1.0116 1.0022 1.0133 1.0047 1.0141 1.0300 1.0223 1.0170 1.0155 1.0028 0.9977 0.9986 1.0009 0.9933 0.9892 0.9948 0.9903
dispcorr: -0.034225039 hartree
energy: -1584.364091979093
dipole: 29.49459 -28.46084 1.03375 -8.37673 9.54900 1.17227 -47.00857 44.07249 -2.93608
magnitude: 3.32618 au
magnitude: 8.45447 debye
