program: Orca
programVersion: 5.0.2
elementType: F F F O O O O N C C C C C C C C C C C C C C C C C C C C C C C C H H H H H H H H H H H H H H H H H H H H H H H H
charge: 0
multiplicity: 1
keywords: wb97x-d3
keywords: def2-TZVPP
keywords: def2/J RIJCOSX
keywords: DEFGRID2
keywords: scfconv7
keywords: smallprint printgap noloewdin
keywords: NOSOSCF
formula: C24H24F3NO4
InChI: InChI=1/C24H24F3NO4/c1-22(2,3)16-9-11-17(12-10-16)23(15-28,21(30)32-14-13-31-4)20(29)18-7-5-6-8-19(18)24(25,26)27/h5-12H,13-14H2,1-4H3
56 atoms
F  -3.238208 -0.321625 0.020328
F  -3.654756 1.667626 -0.695707
F  -4.639098 0.932101 1.062232
O  -1.296969 -2.182521 -1.436218
O  -0.827356 0.908927 -1.426428
O  0.746871 -1.80881 -2.274405
O  -3.111069 -0.933238 -3.264537
N  -0.928341 -2.132357 1.887926
C  5.79023 0.43079 0.708141
C  4.321953 0.0667 0.523312
C  6.374997 -0.154762 1.993167
C  6.597659 -0.112528 -0.478348
C  5.928315 1.957794 0.768211
C  0.125375 -0.861689 -0.130985
C  1.599409 -0.561927 0.107629
C  3.628083 0.523054 -0.599436
C  3.612461 -0.714619 1.426358
C  2.297916 0.218704 -0.811628
C  2.272925 -1.024529 1.226612
C  -0.631449 0.486641 -0.325959
C  -0.079665 -1.678795 -1.424269
C  -1.017873 1.229486 0.917656
C  -0.47028 -1.576119 0.993114
C  -2.353456 1.46678 1.2554
C  -0.008704 1.724909 1.734861
C  -2.651922 2.191758 2.399087
C  -3.475611 0.937409 0.403671
C  -1.739797 -2.857815 -2.61459
C  -0.317196 2.458645 2.869488
C  -1.638618 2.690415 3.202702
C  -2.183793 -1.879766 -3.690529
C  -4.374017 -1.441465 -2.944556
H  6.337094 -1.245268 2.001966
H  7.423461 0.131907 2.085369
H  5.860736 0.211236 2.883485
H  6.26392 0.303836 -1.42904
H  6.514119 -1.197825 -0.546979
H  7.654614 0.136823 -0.365795
H  5.358755 2.372372 1.601179
H  5.575939 2.438755 -0.144618
H  6.973959 2.241081 0.903441
H  4.134051 1.132515 -1.337537
H  4.092849 -1.10136 2.314051
H  1.811455 0.596852 -1.699744
H  1.764316 -1.631612 1.964029
H  1.027414 1.552178 1.480426
H  -3.680534 2.367811 2.678794
H  -2.559078 -3.490203 -2.274933
H  -0.955726 -3.506203 -3.011024
H  0.480359 2.843199 3.490367
H  -1.888175 3.254359 4.090914
H  -1.321836 -1.324805 -4.063217
H  -2.567346 -2.483969 -4.529533
H  -5.029072 -0.591355 -2.762432
H  -4.800764 -2.034612 -3.764648
H  -4.376846 -2.061297 -2.041174
totalener: -1584.33112951 hartree
nucrepener: 3447.90153067 hartree
electener: -5032.23266018 hartree
oneelecener: -9025.92269893 hartree
twoeener: 3993.69003874 hartree
kineticenergy: 1577.97077470 hartree
xcener: -146.966256723568 hartree
chargesum: -0.0000000
charge: -0.169454 -0.159195 -0.174489 -0.232943 -0.237088 -0.319439 -0.306843 0.021527 0.252483 -0.091983 -0.336255 -0.289263 -0.294610 0.749150 -0.220550 -0.147697 -0.084683 -0.154430 -0.166444 0.134377 0.302016 0.095359 -0.451862 -0.229804 -0.156924 -0.045467 0.554752 -0.054306 -0.108813 -0.124680 0.015273 -0.138765 0.097658 0.092495 0.094935 0.089644 0.102401 0.088301 0.096308 0.090518 0.089511 0.112576 0.123258 0.130630 0.124508 0.140715 0.131148 0.117459 0.107531 0.131136 0.133483 0.110079 0.073121 0.114785 0.090071 0.088777
qa: -0.1695 -0.1592 -0.1745 -0.2329 -0.2371 -0.3194 -0.3068 0.0215 0.2525 -0.0920 -0.3363 -0.2893 -0.2946 0.7491 -0.2205 -0.1477 -0.0847 -0.1544 -0.1664 0.1344 0.3020 0.0954 -0.4519 -0.2298 -0.1569 -0.0455 0.5548 -0.0543 -0.1088 -0.1247 0.0153 -0.1388 0.0977 0.0925 0.0949 0.0896 0.1024 0.0883 0.0963 0.0905 0.0895 0.1126 0.1233 0.1306 0.1245 0.1407 0.1311 0.1175 0.1075 0.1311 0.1335 0.1101 0.0731 0.1148 0.0901 0.0888
va: 1.1368 1.1466 1.1315 2.1616 2.1986 2.1816 1.9689 3.1215 3.7776 3.8182 3.9326 3.9220 3.9224 3.2387 3.8229 4.0741 3.9416 4.0844 4.0221 3.8946 4.2731 3.5097 4.1126 4.0145 3.9805 3.9174 4.4116 3.8616 3.9932 3.9664 3.9127 3.9317 1.0025 1.0117 1.0022 1.0079 1.0060 1.0056 1.0070 1.0074 1.0065 1.0111 1.0052 1.0286 1.0312 1.0047 1.0140 0.9901 1.0193 1.0015 0.9999 1.0100 1.0027 0.9971 0.9950 0.9831
dispcorr: -0.033567372 hartree
energy: -1584.364696880891
dipole: 51.97806 -51.04051 0.93756 -2.77279 3.20823 0.43544 -2.22372 2.72461 0.50089
magnitude: 1.14870 au
magnitude: 2.91976 debye
