program: Orca
programVersion: 5.0.2
elementType: F F F O O O O N C C C C C C C C C C C C C C C C C C C C C C C C H H H H H H H H H H H H H H H H H H H H H H H H
charge: 0
multiplicity: 1
keywords: wb97x-d3
keywords: def2-TZVPP
keywords: def2/J RIJCOSX
keywords: DEFGRID2
keywords: scfconv7
keywords: smallprint printgap noloewdin
keywords: NOSOSCF
formula: C24H24F3NO4
InChI: InChI=1/C24H24F3NO4/c1-22(2,3)16-9-11-17(12-10-16)23(15-28,21(30)32-14-13-31-4)20(29)18-7-5-6-8-19(18)24(25,26)27/h5-12H,13-14H2,1-4H3
56 atoms
F  -1.683281 0.270353 3.532197
F  -1.938636 2.369786 3.18014
F  -0.43295 1.279015 2.096763
O  0.064994 -2.371308 -1.638948
O  -0.553028 1.904021 -0.865103
O  -0.960355 -0.627425 -2.618623
O  -2.58353 -2.978101 -1.285301
N  -0.787277 -2.007447 1.543981
C  5.64165 0.903526 -0.249558
C  4.15566 0.570502 -0.309157
C  5.873689 1.955779 0.84289
C  6.438464 -0.365612 0.081522
C  6.162697 1.463288 -1.573286
C  -0.077362 -0.39493 -0.380458
C  1.408517 -0.071679 -0.343774
C  3.524839 0.002443 0.79651
C  3.368035 0.81294 -1.42931
C  2.17875 -0.314445 0.7859
C  2.016064 0.505394 -1.449652
C  -0.952892 0.897305 -0.369749
C  -0.402014 -1.137543 -1.693722
C  -2.353056 0.771858 0.166393
C  -0.464192 -1.293756 0.703443
C  -2.689106 0.910906 1.510404
C  -3.361603 0.540205 -0.765439
C  -4.017209 0.809007 1.907672
C  -1.679219 1.204308 2.580735
C  -0.567352 -3.368812 -2.43977
C  -4.681653 0.439732 -0.362375
C  -5.011604 0.570142 0.977552
C  -1.676503 -3.986347 -1.616076
C  -3.457506 -3.320282 -0.241265
H  6.932513 2.215234 0.905625
H  5.315449 2.869099 0.633035
H  5.564505 1.600283 1.826267
H  6.159137 -0.786477 1.047689
H  7.507011 -0.145036 0.119577
H  6.281907 -1.137906 -0.672741
H  6.040816 0.754467 -2.39419
H  7.228335 1.680516 -1.488201
H  5.665155 2.39419 -1.849927
H  4.089504 -0.203242 1.69726
H  3.798392 1.253516 -2.317347
H  1.739894 -0.763086 1.667333
H  1.448334 0.718896 -2.345176
H  -3.109177 0.438181 -1.810925
H  -4.281217 0.922188 2.95108
H  0.193821 -4.11262 -2.672411
H  -0.94102 -2.945081 -3.372951
H  -5.452908 0.261891 -1.099709
H  -6.041634 0.494644 1.298437
H  -2.148116 -4.792488 -2.198577
H  -1.245321 -4.445575 -0.715243
H  -2.915941 -3.583325 0.673431
H  -4.073887 -2.447201 -0.032693
H  -4.115011 -4.155537 -0.511859
totalener: -1584.33133798 hartree
nucrepener: 3473.14689864 hartree
electener: -5057.47823662 hartree
oneelecener: -9076.66187889 hartree
twoeener: 4019.18364228 hartree
kineticenergy: 1577.97574099 hartree
xcener: -146.969525805456 hartree
chargesum: -0.0000000
charge: -0.159555 -0.167457 -0.166920 -0.264066 -0.245651 -0.321487 -0.315980 -0.004880 0.240846 -0.067587 -0.290123 -0.291073 -0.336121 0.769196 -0.160968 -0.130552 -0.128714 -0.163992 -0.147245 0.204839 0.240359 0.186607 -0.495028 -0.200552 -0.193838 -0.083134 0.557707 -0.006224 -0.148577 -0.127837 0.005242 -0.113158 0.087096 0.102474 0.088473 0.088281 0.087141 0.099431 0.096896 0.091307 0.095586 0.108051 0.118563 0.122101 0.128384 0.144199 0.119742 0.105738 0.109764 0.135373 0.133752 0.083666 0.088687 0.099887 0.094744 0.096586
qa: -0.1596 -0.1675 -0.1669 -0.2641 -0.2457 -0.3215 -0.3160 -0.0049 0.2408 -0.0676 -0.2901 -0.2911 -0.3361 0.7692 -0.1610 -0.1306 -0.1287 -0.1640 -0.1472 0.2048 0.2404 0.1866 -0.4950 -0.2006 -0.1938 -0.0831 0.5577 -0.0062 -0.1486 -0.1278 0.0052 -0.1132 0.0871 0.1025 0.0885 0.0883 0.0871 0.0994 0.0969 0.0913 0.0956 0.1081 0.1186 0.1221 0.1284 0.1442 0.1197 0.1057 0.1098 0.1354 0.1338 0.0837 0.0887 0.0999 0.0947 0.0966
va: 1.1473 1.1412 1.1313 2.1520 2.2286 2.1497 1.9661 3.0902 3.7857 3.7896 3.9237 3.9213 3.9303 3.2204 3.8740 4.0859 3.9463 4.0569 4.1360 3.9988 4.3450 3.4546 4.0034 3.8938 3.9612 4.0081 4.4225 3.8921 3.9340 3.9395 3.9247 3.9120 1.0059 1.0061 1.0074 1.0079 1.0066 1.0058 1.0027 1.0115 1.0026 1.0128 1.0062 1.0261 1.0235 1.0238 1.0157 1.0005 1.0173 1.0003 0.9988 1.0018 0.9946 0.9982 0.9918 0.9924
dispcorr: -0.034798035 hartree
energy: -1584.366136014079
dipole: 35.52064 -35.87262 -0.35198 -14.29526 13.06893 -1.22632 -20.07601 19.42614 -0.64987
magnitude: 1.43181 au
magnitude: 3.63938 debye
