program: Orca
programVersion: 5.0.2
elementType: F F F O O O O N C C C C C C C C C C C C C C C C C C C C C C C C H H H H H H H H H H H H H H H H H H H H H H H H
charge: 0
multiplicity: 1
keywords: wb97x-d3
keywords: def2-TZVPP
keywords: def2/J RIJCOSX
keywords: DEFGRID2
keywords: scfconv7
keywords: smallprint printgap noloewdin
keywords: NOSOSCF
formula: C24H24F3NO4
InChI: InChI=1/C24H24F3NO4/c1-22(2,3)16-9-11-17(12-10-16)23(15-28,21(30)32-14-13-31-4)20(29)18-7-5-6-8-19(18)24(25,26)27/h5-12H,13-14H2,1-4H3
56 atoms
F  -0.756696 3.340652 2.641857
F  0.709207 2.453294 1.35307
F  -0.494474 1.20474 2.637002
O  -0.748981 -3.302773 -0.105329
O  -2.981641 -0.622868 2.053731
O  -2.416815 -1.982808 -0.812612
O  1.165243 -3.570414 -2.147344
N  -0.376973 -2.493933 3.148525
C  3.767527 1.290404 -1.464589
C  2.531574 0.625346 -0.872897
C  4.262713 2.37426 -0.497207
C  4.863389 0.235491 -1.663451
C  3.483766 1.946631 -2.815336
C  -0.960318 -1.217861 0.950694
C  0.274407 -0.581263 0.320732
C  2.612672 -0.018923 0.360312
C  1.292434 0.626993 -1.502471
C  1.512349 -0.611077 0.949708
C  0.183256 0.029427 -0.923626
C  -2.147247 -0.256465 1.282711
C  -1.490927 -2.22059 -0.087985
C  -2.293102 1.034609 0.530724
C  -0.635392 -1.9365 2.178823
C  -1.551508 2.187486 0.772088
C  -3.28564 1.060348 -0.446667
C  -1.779961 3.330128 0.013888
C  -0.517129 2.288431 1.853358
C  -0.901947 -4.212139 -1.199034
C  -3.504547 2.199186 -1.200562
C  -2.742942 3.335578 -0.977571
C  -0.192387 -3.704349 -2.433431
C  1.880137 -2.89394 -3.139667
H  4.54086 1.962646 0.473229
H  5.142992 2.87599 -0.903875
H  3.493863 3.128568 -0.324842
H  5.148715 -0.242758 -0.726204
H  5.761609 0.691059 -2.084878
H  4.533575 -0.549264 -2.34627
H  3.153716 1.222226 -3.562234
H  4.393513 2.411678 -3.197264
H  2.72685 2.729285 -2.741607
H  3.555876 -0.058792 0.890429
H  1.164788 1.10473 -2.463719
H  1.628558 -1.093457 1.910762
H  -0.755388 0.058538 -1.461813
H  -3.87605 0.17381 -0.626575
H  -1.207769 4.228877 0.202644
H  -1.956515 -4.389814 -1.415403
H  -0.453328 -5.141797 -0.853396
H  -4.275219 2.198597 -1.959459
H  -2.9080 4.229918 -1.562638
H  -0.374162 -4.426025 -3.246258
H  -0.634379 -2.752047 -2.760508
H  1.868333 -3.423574 -4.101466
H  1.496023 -1.879244 -3.30418
H  2.91373 -2.81351 -2.805683
totalener: -1584.32897060 hartree
nucrepener: 3569.49838126 hartree
electener: -5153.82735186 hartree
oneelecener: -9268.33801789 hartree
twoeener: 4114.51066603 hartree
kineticenergy: 1577.98876097 hartree
xcener: -146.972189385418 hartree
chargesum: -0.0000000
charge: -0.165884 -0.161116 -0.165854 -0.227074 -0.240729 -0.356219 -0.304872 0.023314 0.271238 -0.049487 -0.291855 -0.289080 -0.336708 0.697349 -0.180017 -0.100373 -0.180316 -0.146721 -0.276421 0.182156 0.297035 0.112795 -0.388386 -0.121747 -0.170229 -0.128135 0.553005 -0.000790 -0.124572 -0.116604 -0.016710 -0.104763 0.091936 0.088484 0.099137 0.093411 0.091131 0.084866 0.090889 0.093328 0.096467 0.109890 0.121827 0.122347 0.142826 0.135046 0.118686 0.099097 0.111111 0.135709 0.134373 0.090906 0.086586 0.091413 0.066670 0.111636
qa: -0.1659 -0.1611 -0.1659 -0.2271 -0.2407 -0.3562 -0.3049 0.0233 0.2712 -0.0495 -0.2919 -0.2891 -0.3367 0.6973 -0.1800 -0.1004 -0.1803 -0.1467 -0.2764 0.1822 0.2970 0.1128 -0.3884 -0.1217 -0.1702 -0.1281 0.5530 -0.0008 -0.1246 -0.1166 -0.0167 -0.1048 0.0919 0.0885 0.0991 0.0934 0.0911 0.0849 0.0909 0.0933 0.0965 0.1099 0.1218 0.1223 0.1428 0.1350 0.1187 0.0991 0.1111 0.1357 0.1344 0.0909 0.0866 0.0914 0.0667 0.1116
va: 1.1451 1.1336 1.1382 2.2129 2.2230 2.1213 1.9646 3.1168 3.7460 3.7261 3.9244 3.9288 3.9357 3.4052 3.5588 4.0612 3.9106 4.0844 4.0347 4.0246 4.2683 3.5225 4.1354 3.7954 3.9985 4.0340 4.4181 3.9207 3.9622 3.9431 3.9336 3.9257 1.0074 1.0061 1.0090 1.0078 1.0071 1.0114 1.0021 1.0120 1.0029 1.0125 1.0068 1.0282 1.0053 1.0260 1.0171 1.0126 1.0023 0.9986 0.9988 1.0026 0.9954 0.9924 0.9936 0.9960
dispcorr: -0.037124746 hartree
energy: -1584.366095341012
dipole: 33.51396 -32.86970 0.64426 -6.65635 7.59752 0.94117 -42.45550 39.33697 -3.11854
magnitude: 3.32056 au
magnitude: 8.44020 debye
