program: Orca
programVersion: 5.0.2
elementType: F F F O O O O N C C C C C C C C C C C C C C C C C C C C C C C C H H H H H H H H H H H H H H H H H H H H H H H H
charge: 0
multiplicity: 1
keywords: wb97x-d3
keywords: def2-TZVPP
keywords: def2/J RIJCOSX
keywords: DEFGRID2
keywords: scfconv7
keywords: smallprint printgap noloewdin
keywords: NOSOSCF
formula: C24H24F3NO4
InChI: InChI=1/C24H24F3NO4/c1-22(2,3)16-9-11-17(12-10-16)23(15-28,21(30)32-14-13-31-4)20(29)18-7-5-6-8-19(18)24(25,26)27/h5-12H,13-14H2,1-4H3
56 atoms
F  -3.418973 2.788094 0.057049
F  -4.696678 1.43424 1.124704
F  -3.325069 0.673424 -0.345395
O  -1.510211 -0.30714 -2.389141
O  -0.633224 2.044083 -0.81724
O  0.675787 -0.491743 -2.880059
O  -1.784821 -2.992424 -2.975635
N  -1.392967 -2.216275 0.495515
C  5.633241 -0.253221 0.903284
C  4.15555 -0.298419 0.534951
C  6.472051 -0.314885 -0.379727
C  5.931166 1.054469 1.648181
C  6.043197 -1.420145 1.801313
C  -0.043339 -0.257383 -0.576043
C  1.42717 -0.306299 -0.190448
C  3.612205 0.696458 -0.28043
C  3.293598 -1.297875 0.967956
C  2.279911 0.698463 -0.641328
C  1.950384 -1.305199 0.6134
C  -0.624375 1.097582 -0.086743
C  -0.22274 -0.365394 -2.109966
C  -1.080254 1.167186 1.340844
C  -0.801719 -1.351337 0.023612
C  -2.411218 1.419325 1.683697
C  -0.134325 1.016401 2.348334
C  -2.770773 1.513009 3.019743
C  -3.466462 1.582751 0.624868
C  -1.985152 -0.749623 -3.658952
C  -0.501042 1.122263 3.680569
C  -1.819376 1.36788 4.016806
C  -2.708953 -2.057192 -3.440575
C  -2.370441 -4.102206 -2.353689
H  6.263668 0.521097 -1.047693
H  7.536914 -0.285543 -0.140598
H  6.277073 -1.23428 -0.933121
H  6.986627 1.104222 1.922524
H  5.343435 1.129152 2.564128
H  5.710957 1.933234 1.041401
H  7.105095 -1.346768 2.039446
H  5.887359 -2.385234 1.316536
H  5.499003 -1.422283 2.747275
H  4.241441 1.494857 -0.652922
H  3.655094 -2.100643 1.595013
H  1.911059 1.491395 -1.277556
H  1.319418 -2.105094 0.978518
H  0.899697 0.828846 2.095528
H  -3.799773 1.693326 3.295504
H  -1.163826 -0.857259 -4.368099
H  -2.672134 0.011055 -4.030724
H  0.24837 1.008248 4.451891
H  -2.115229 1.442188 5.054255
H  -3.523499 -1.901914 -2.718306
H  -3.175261 -2.370442 -4.387386
H  -2.99399 -4.684471 -3.043702
H  -1.566121 -4.741495 -1.994905
H  -2.984152 -3.811797 -1.493467
totalener: -1584.33308705 hartree
nucrepener: 3426.79400880 hartree
electener: -5011.12709585 hartree
oneelecener: -8983.78599743 hartree
twoeener: 3972.65890158 hartree
kineticenergy: 1577.98262699 hartree
xcener: -146.968474193667 hartree
chargesum: -0.0000000
charge: -0.154924 -0.172312 -0.162019 -0.248257 -0.248154 -0.301007 -0.319569 -0.011446 0.250381 -0.086406 -0.289277 -0.293423 -0.336524 0.821079 -0.251759 -0.142742 -0.080498 -0.153416 -0.173625 0.152366 0.292168 0.084368 -0.462790 -0.231063 -0.137470 -0.058363 0.532732 -0.026570 -0.114776 -0.119884 0.030797 -0.121259 0.089563 0.087896 0.103326 0.089209 0.096294 0.089831 0.092490 0.097702 0.094227 0.112838 0.121627 0.130986 0.121682 0.146187 0.132362 0.111933 0.104118 0.130710 0.133787 0.077195 0.078035 0.088589 0.109640 0.093416
qa: -0.1549 -0.1723 -0.1620 -0.2483 -0.2482 -0.3010 -0.3196 -0.0114 0.2504 -0.0864 -0.2893 -0.2934 -0.3365 0.8211 -0.2518 -0.1427 -0.0805 -0.1534 -0.1736 0.1524 0.2922 0.0844 -0.4628 -0.2311 -0.1375 -0.0584 0.5327 -0.0266 -0.1148 -0.1199 0.0308 -0.1213 0.0896 0.0879 0.1033 0.0892 0.0963 0.0898 0.0925 0.0977 0.0942 0.1128 0.1216 0.1310 0.1217 0.1462 0.1324 0.1119 0.1041 0.1307 0.1338 0.0772 0.0780 0.0886 0.1096 0.0934
va: 1.1494 1.1320 1.1374 2.1627 2.2024 2.2092 1.9710 3.0978 3.7810 3.8178 3.9225 3.9224 3.9317 3.0761 3.8161 4.0810 3.9417 4.0948 4.0069 3.8888 4.3077 3.5173 4.0809 4.0076 3.9580 3.9219 4.4579 3.8880 4.0011 3.9588 3.9313 3.9217 1.0080 1.0053 1.0060 1.0065 1.0071 1.0076 1.0117 1.0027 1.0026 1.0112 1.0059 1.0246 1.0315 1.0005 1.0135 1.0237 1.0005 1.0019 0.9997 0.9967 0.9995 0.9893 0.9952 0.9951
dispcorr: -0.032773281 hartree
energy: -1584.365860334781
dipole: 52.88735 -52.32242 0.56493 -20.18920 20.11829 -0.07091 2.14833 -1.10919 1.03914
magnitude: 1.18490 au
magnitude: 3.01177 debye
