program: Orca
programVersion: 5.0.2
elementType: F F F O O O O N C C C C C C C C C C C C C C C C C C C C C C C C H H H H H H H H H H H H H H H H H H H H H H H H
charge: 0
multiplicity: 1
keywords: wb97x-d3
keywords: def2-TZVPP
keywords: def2/J RIJCOSX
keywords: DEFGRID2
keywords: scfconv7
keywords: smallprint printgap noloewdin
keywords: NOSOSCF
formula: C24H24F3NO4
InChI: InChI=1/C24H24F3NO4/c1-22(2,3)16-9-11-17(12-10-16)23(15-28,21(30)32-14-13-31-4)20(29)18-7-5-6-8-19(18)24(25,26)27/h5-12H,13-14H2,1-4H3
56 atoms
F  -1.009237 2.813359 3.146951
F  0.884297 2.354106 2.248093
F  -0.585231 0.800493 2.529806
O  -0.621017 -2.986904 -1.023816
O  -2.931834 -0.374659 0.871933
O  -1.805372 -1.301272 -1.907357
O  -2.567507 -5.579756 -2.58909
N  -0.72402 -2.642106 2.247041
C  4.504797 1.551473 -0.591446
C  3.158772 0.857168 -0.426615
C  5.642046 0.538521 -0.407262
C  4.659854 2.195187 -1.969672
C  4.620804 2.649155 0.474467
C  -0.721852 -0.996051 0.22361
C  0.653504 -0.382189 -0.008682
C  2.897308 0.103034 0.715455
C  2.134051 0.95857 -1.361624
C  1.676298 -0.511114 0.922862
C  0.903519 0.353123 -1.160667
C  -1.882715 0.028529 0.471224
C  -1.132747 -1.776804 -1.036788
C  -1.679768 1.460717 0.077115
C  -0.720638 -1.919214 1.354901
C  -0.995832 2.398818 0.843306
C  -2.253595 1.854276 -1.128962
C  -0.865705 3.70463 0.384326
C  -0.422138 2.085661 2.19326
C  -1.008563 -3.912477 -2.044415
C  -2.11545 3.153794 -1.582633
C  -1.412065 4.080349 -0.828839
C  -2.298926 -4.599802 -1.631353
C  -3.727594 -6.309774 -2.304649
H  5.5781 -0.265101 -1.141986
H  6.609379 1.029135 -0.529829
H  5.636711 0.082985 0.582869
H  4.573042 1.463029 -2.77442
H  5.645208 2.655593 -2.053093
H  3.923928 2.981799 -2.143629
H  3.821616 3.38441 0.370737
H  5.574544 3.172856 0.382462
H  4.563198 2.242087 1.484503
H  3.657435 -0.01118 1.477713
H  2.276254 1.52195 -2.272822
H  1.528524 -1.087586 1.826144
H  0.142182 0.472177 -1.919995
H  -2.793414 1.129218 -1.721552
H  -0.337464 4.438379 0.979217
H  -0.194979 -4.633136 -2.104734
H  -1.113828 -3.414907 -3.009046
H  -2.561751 3.441992 -2.52487
H  -1.300444 5.097894 -1.177453
H  -2.175172 -5.033731 -0.628192
H  -3.116076 -3.866105 -1.567951
H  -3.656661 -6.842457 -1.347947
H  -4.619567 -5.671956 -2.267443
H  -3.8632 -7.04402 -3.097141
totalener: -1584.32988789 hartree
nucrepener: 3450.96351353 hartree
electener: -5035.29340142 hartree
oneelecener: -9031.22836843 hartree
twoeener: 3995.93496701 hartree
kineticenergy: 1577.98019210 hartree
xcener: -146.968715172981 hartree
chargesum: 0.0000000
charge: -0.163447 -0.166771 -0.162909 -0.253501 -0.241201 -0.354000 -0.322096 0.018780 0.240832 -0.054151 -0.292143 -0.332763 -0.289346 0.709175 -0.226527 -0.105009 -0.129806 -0.203233 -0.189090 0.189266 0.274081 0.141957 -0.395118 -0.120455 -0.193894 -0.139322 0.554564 0.015579 -0.120271 -0.113457 0.010588 -0.110965 0.101093 0.088399 0.089141 0.102287 0.092535 0.089439 0.095298 0.089167 0.092359 0.112847 0.119426 0.128267 0.134332 0.143354 0.119514 0.110176 0.100171 0.136942 0.134746 0.080683 0.089044 0.083756 0.082829 0.108846
qa: -0.1634 -0.1668 -0.1629 -0.2535 -0.2412 -0.3540 -0.3221 0.0188 0.2408 -0.0542 -0.2921 -0.3328 -0.2893 0.7092 -0.2265 -0.1050 -0.1298 -0.2032 -0.1891 0.1893 0.2741 0.1420 -0.3951 -0.1205 -0.1939 -0.1393 0.5546 0.0156 -0.1203 -0.1135 0.0106 -0.1110 0.1011 0.0884 0.0891 0.1023 0.0925 0.0894 0.0953 0.0892 0.0924 0.1128 0.1194 0.1283 0.1343 0.1434 0.1195 0.1102 0.1002 0.1369 0.1347 0.0807 0.0890 0.0838 0.0828 0.1088
va: 1.1479 1.1306 1.1400 2.1836 2.2288 2.1205 1.9832 3.1132 3.7838 3.7831 3.9219 3.9266 3.9269 3.4025 3.6716 4.0400 3.9969 4.0802 4.0994 4.0128 4.2847 3.4981 4.1190 3.8159 3.9824 4.0428 4.4157 3.8550 3.9647 3.9452 3.9428 3.9378 1.0051 1.0064 1.0088 1.0024 1.0115 1.0029 1.0085 1.0065 1.0072 1.0114 1.0074 1.0280 1.0147 1.0223 1.0166 1.0040 1.0177 0.9978 0.9984 0.9950 0.9993 0.9903 0.9902 0.9943
dispcorr: -0.033724675 hartree
energy: -1584.363612568854
dipole: 26.92341 -26.02949 0.89392 -10.09511 11.22568 1.13058 -29.97240 28.19235 -1.78005
magnitude: 2.29039 au
magnitude: 5.82170 debye
