program: Orca
programVersion: 5.0.2
elementType: F F F O O O O N C C C C C C C C C C C C C C C C C C C C C C C C H H H H H H H H H H H H H H H H H H H H H H H H
charge: 0
multiplicity: 1
keywords: wb97x-d3
keywords: def2-TZVPP
keywords: def2/J RIJCOSX
keywords: DEFGRID2
keywords: scfconv7
keywords: smallprint printgap noloewdin
keywords: NOSOSCF
formula: C24H24F3NO4
InChI: InChI=1/C24H24F3NO4/c1-22(2,3)16-9-11-17(12-10-16)23(15-28,21(30)32-14-13-31-4)20(29)18-7-5-6-8-19(18)24(25,26)27/h5-12H,13-14H2,1-4H3
56 atoms
F  -1.424257 1.813647 -0.763892
F  -2.223525 3.046038 0.816965
F  -3.434716 2.550312 -0.875394
O  -0.689953 -1.229827 -0.873383
O  -0.243232 1.276406 1.862718
O  -0.337857 -3.116797 0.284138
O  -2.87089 -0.338427 -2.549738
N  0.485767 -2.217121 3.511079
C  5.621516 0.518866 -0.725055
C  4.222975 0.160556 -0.237595
C  6.520454 0.810817 0.484479
C  6.193313 -0.662615 -1.519593
C  5.623262 1.752318 -1.62764
C  0.283391 -0.974998 1.225703
C  1.664832 -0.537413 0.738566
C  3.08187 0.857924 -0.619971
C  4.043107 -0.911983 0.633518
C  1.822476 0.515816 -0.150868
C  2.793693 -1.255986 1.116178
C  -0.682914 0.226749 1.504815
C  -0.294184 -1.928253 0.17378
C  -2.152172 -0.035116 1.367283
C  0.404814 -1.691853 2.492379
C  -3.01277 0.832424 0.681447
C  -2.683779 -1.157333 1.993846
C  -4.370556 0.556934 0.645899
C  -2.515241 2.062959 -0.031176
C  -1.224502 -1.953608 -1.983756
C  -4.04523 -1.413977 1.965376
C  -4.889562 -0.556074 1.288776
C  -1.711976 -0.965336 -3.008766
C  -3.399391 0.567194 -3.477676
H  7.525963 1.080954 0.155968
H  6.12723 1.638353 1.076201
H  6.614844 -0.051107 1.145209
H  6.258184 -1.56855 -0.916239
H  7.199645 -0.433266 -1.875738
H  5.573985 -0.889484 -2.388568
H  5.03463 1.60016 -2.533899
H  6.643481 1.978854 -1.940341
H  5.237737 2.635197 -1.115024
H  3.155008 1.697734 -1.296416
H  4.89359 -1.4980 0.958456
H  0.976706 1.094478 -0.488679
H  2.712067 -2.091567 1.799016
H  -2.045268 -1.833578 2.544799
H  -5.043043 1.208661 0.108078
H  -2.039183 -2.602087 -1.654232
H  -0.444145 -2.582501 -2.418947
H  -4.434902 -2.284888 2.474093
H  -5.953095 -0.748069 1.252713
H  -0.917344 -0.239741 -3.238252
H  -1.903331 -1.525651 -3.937356
H  -4.309843 0.987019 -3.054607
H  -2.708461 1.390684 -3.694983
H  -3.654815 0.080499 -4.428067
totalener: -1584.33228023 hartree
nucrepener: 3476.89823027 hartree
electener: -5061.23051050 hartree
oneelecener: -9083.40977843 hartree
twoeener: 4022.17926793 hartree
kineticenergy: 1577.96446399 hartree
xcener: -146.963944399477 hartree
chargesum: 0.0000000
charge: -0.178539 -0.149636 -0.184826 -0.245615 -0.223216 -0.294943 -0.312506 0.016259 0.244668 -0.064553 -0.290060 -0.290234 -0.336075 0.653827 -0.096656 -0.136056 -0.136942 -0.136769 -0.183654 0.044942 0.170182 0.122156 -0.314603 -0.238963 -0.115956 -0.060031 0.575012 -0.016037 -0.132964 -0.110771 0.019652 -0.125694 0.086684 0.104096 0.088845 0.089549 0.088700 0.097154 0.091362 0.091526 0.100594 0.119665 0.110681 0.125257 0.127677 0.153795 0.124696 0.108293 0.104606 0.137565 0.133781 0.078463 0.075700 0.099499 0.096222 0.094190
qa: -0.1785 -0.1496 -0.1848 -0.2456 -0.2232 -0.2949 -0.3125 0.0163 0.2447 -0.0646 -0.2901 -0.2902 -0.3361 0.6538 -0.0967 -0.1361 -0.1369 -0.1368 -0.1837 0.0449 0.1702 0.1222 -0.3146 -0.2390 -0.1160 -0.0600 0.5750 -0.0160 -0.1330 -0.1108 0.0197 -0.1257 0.0867 0.1041 0.0888 0.0895 0.0887 0.0972 0.0914 0.0915 0.1006 0.1197 0.1107 0.1253 0.1277 0.1538 0.1247 0.1083 0.1046 0.1376 0.1338 0.0785 0.0757 0.0995 0.0962 0.0942
va: 1.1137 1.1557 1.1131 2.1706 2.2348 2.2044 1.9731 3.1053 3.7731 3.7763 3.9232 3.9227 3.9304 3.2515 3.8214 3.9972 4.0626 4.0738 4.1162 3.9941 4.4072 3.3798 4.0509 3.9842 3.9101 3.9098 4.3625 3.9117 4.0212 3.9576 3.9713 3.9232 1.0062 1.0052 1.0076 1.0076 1.0061 1.0065 1.0029 1.0118 1.0021 1.0050 1.0126 1.0234 1.0171 1.0143 1.0158 1.0092 1.0043 0.9996 0.9989 0.9961 0.9990 0.9977 0.9912 0.9945
dispcorr: -0.034244576 hartree
energy: -1584.366524806828
dipole: 39.91450 -40.61277 -0.69828 -9.25728 9.21305 -0.04423 -22.34561 20.10213 -2.24347
magnitude: 2.35005 au
magnitude: 5.97334 debye
