program: Orca
programVersion: 5.0.2
elementType: F F F O O O O N C C C C C C C C C C C C C C C C C C C C C C C C H H H H H H H H H H H H H H H H H H H H H H H H
charge: 0
multiplicity: 1
keywords: wb97x-d3
keywords: def2-TZVPP
keywords: def2/J RIJCOSX
keywords: DEFGRID2
keywords: scfconv7
keywords: smallprint printgap noloewdin
keywords: NOSOSCF
formula: C24H24F3NO4
InChI: InChI=1/C24H24F3NO4/c1-22(2,3)16-9-11-17(12-10-16)23(15-28,21(30)32-14-13-31-4)20(29)18-7-5-6-8-19(18)24(25,26)27/h5-12H,13-14H2,1-4H3
56 atoms
F  -3.551261 2.828793 0.193307
F  -4.643104 1.357597 1.312785
F  -3.310376 0.737431 -0.253892
O  -1.629003 -0.237096 -2.400176
O  -0.687958 2.152616 -0.894189
O  0.550025 -0.387929 -2.936294
O  -1.654858 -2.933372 -2.996254
N  -1.502017 -2.065462 0.504776
C  5.530035 -0.305527 0.924004
C  4.067425 -0.257685 0.500631
C  6.331608 0.87233 0.369774
C  5.62155 -0.267077 2.455303
C  6.156555 -1.605983 0.404203
C  -0.127059 -0.154276 -0.619126
C  1.344407 -0.233818 -0.242833
C  3.555127 0.71809 -0.348976
C  3.177359 -1.227501 0.958522
C  2.219829 0.733207 -0.719161
C  1.841168 -1.219958 0.59959
C  -0.655512 1.225285 -0.140688
C  -0.333715 -0.276212 -2.147598
C  -1.018567 1.342355 1.311227
C  -0.902522 -1.218639 0.01085
C  -2.336021 1.535017 1.732478
C  -0.000504 1.297761 2.257192
C  -2.612919 1.671201 3.084987
C  -3.463957 1.615848 0.741808
C  -2.120112 -0.720905 -3.647949
C  -0.285419 1.444789 3.605368
C  -1.592033 1.626351 4.020464
C  -2.692543 -2.099492 -3.411712
C  -2.088114 -4.116809 -2.384775
H  7.366395 0.806037 0.70843
H  6.349824 0.88065 -0.721185
H  5.939339 1.831797 0.71129
H  5.175109 0.644886 2.854378
H  6.665392 -0.295557 2.773554
H  5.117688 -1.114201 2.921476
H  6.102115 -1.660736 -0.683771
H  5.657123 -2.489433 0.80327
H  7.208171 -1.665822 0.691808
H  4.196725 1.492767 -0.744145
H  3.524546 -2.016193 1.614211
H  1.872244 1.51423 -1.38172
H  1.189906 -1.991356 0.988838
H  1.024799 1.161718 1.94351
H  -3.630823 1.806779 3.421535
H  -1.331227 -0.735184 -4.400879
H  -2.901479 -0.033143 -3.971216
H  0.519201 1.414078 4.327442
H  -1.822873 1.731636 5.071662
H  -3.486178 -2.034865 -2.653199
H  -3.163258 -2.455824 -4.341028
H  -1.202824 -4.676825 -2.088836
H  -2.6840 -3.918395 -1.486763
H  -2.680826 -4.742583 -3.0638
totalener: -1584.33281346 hartree
nucrepener: 3434.92950862 hartree
electener: -5019.26232208 hartree
oneelecener: -9000.04567238 hartree
twoeener: 3980.78335030 hartree
kineticenergy: 1577.98356787 hartree
xcener: -146.969012372135 hartree
chargesum: -0.0000000
charge: -0.156610 -0.171509 -0.160403 -0.249960 -0.246841 -0.299498 -0.318335 -0.012120 0.250692 -0.083916 -0.335360 -0.295460 -0.289693 0.816821 -0.247181 -0.126929 -0.098679 -0.121706 -0.207920 0.162617 0.294142 0.092402 -0.465702 -0.221583 -0.147441 -0.060630 0.531312 -0.024599 -0.115201 -0.122975 0.026769 -0.120359 0.092045 0.096547 0.097582 0.095856 0.089905 0.088240 0.103827 0.088434 0.088287 0.123488 0.111088 0.127572 0.123593 0.139639 0.131255 0.110615 0.104367 0.130999 0.133551 0.079989 0.079155 0.108230 0.093797 0.087794
qa: -0.1566 -0.1715 -0.1604 -0.2500 -0.2468 -0.2995 -0.3183 -0.0121 0.2507 -0.0839 -0.3354 -0.2955 -0.2897 0.8168 -0.2472 -0.1269 -0.0987 -0.1217 -0.2079 0.1626 0.2941 0.0924 -0.4657 -0.2216 -0.1474 -0.0606 0.5313 -0.0246 -0.1152 -0.1230 0.0268 -0.1204 0.0920 0.0965 0.0976 0.0959 0.0899 0.0882 0.1038 0.0884 0.0883 0.1235 0.1111 0.1276 0.1236 0.1396 0.1313 0.1106 0.1044 0.1310 0.1336 0.0800 0.0792 0.1082 0.0938 0.0878
va: 1.1467 1.1335 1.1395 2.1569 2.2046 2.2094 1.9714 3.0992 3.7735 3.8035 3.9334 3.9224 3.9220 3.0746 3.8028 3.9779 4.0462 4.0681 4.0312 3.9073 4.3074 3.5358 4.0644 3.9957 3.9686 3.9354 4.4600 3.8935 3.9955 3.9612 3.9278 3.9205 1.0114 1.0025 1.0022 1.0069 1.0069 1.0075 1.0059 1.0073 1.0056 1.0052 1.0125 1.0279 1.0295 1.0052 1.0137 1.0224 1.0004 1.0016 0.9997 0.9956 0.9999 0.9948 0.9955 0.9899
dispcorr: -0.033031112 hartree
energy: -1584.365844575554
dipole: 53.41537 -52.72576 0.68961 -21.44392 21.30156 -0.14237 1.86698 -0.84013 1.02684
magnitude: 1.24508 au
magnitude: 3.16475 debye
