program: Orca
programVersion: 5.0.2
elementType: F F F O O O O N C C C C C C C C C C C C C C C C C C C C C C C C H H H H H H H H H H H H H H H H H H H H H H H H
charge: 0
multiplicity: 1
keywords: wb97x-d3
keywords: def2-TZVPP
keywords: def2/J RIJCOSX
keywords: DEFGRID2
keywords: scfconv7
keywords: smallprint printgap noloewdin
keywords: NOSOSCF
formula: C24H24F3NO4
InChI: InChI=1/C24H24F3NO4/c1-22(2,3)16-9-11-17(12-10-16)23(15-28,21(30)32-14-13-31-4)20(29)18-7-5-6-8-19(18)24(25,26)27/h5-12H,13-14H2,1-4H3
56 atoms
F  -3.41964 1.142288 -0.301309
F  -3.056684 3.252033 -0.028264
F  -4.611975 2.271495 1.075824
O  -1.646296 -0.995023 -1.738263
O  -0.670989 1.74881 -0.780818
O  0.460768 -0.924847 -2.510029
O  -2.815815 -3.227365 -4.314146
N  -1.10758 -2.292341 1.316025
C  5.797043 -0.095254 0.643532
C  4.293101 -0.178548 0.412315
C  6.437028 -1.462449 0.369813
C  6.466127 0.934293 -0.267758
C  6.055903 0.308743 2.101048
C  -0.006616 -0.451736 -0.170055
C  1.498408 -0.370304 0.048988
C  3.615626 0.65289 -0.47368
C  3.528969 -1.110411 1.112978
C  2.244648 0.564697 -0.655903
C  2.16016 -1.211697 0.936425
C  -0.645325 0.942979 0.103503
C  -0.341986 -0.816866 -1.636851
C  -1.146301 1.23161 1.479632
C  -0.625701 -1.47242 0.6709
C  -2.396921 1.815058 1.716315
C  -0.307051 0.958664 2.554494
C  -2.771057 2.11182 3.01878
C  -3.368668 2.122014 0.603633
C  -2.193038 -1.389439 -2.999067
C  -0.685033 1.271291 3.848797
C  -1.919901 1.847717 4.080463
C  -2.123974 -2.899718 -3.145501
C  -2.815463 -4.600703 -4.580548
H  6.266918 -1.778267 -0.660199
H  7.515417 -1.415353 0.533015
H  6.044751 -2.242222 1.022928
H  7.540423 0.950287 -0.079138
H  6.094059 1.944919 -0.092002
H  6.326146 0.698738 -1.324038
H  5.645434 -0.415463 2.805606
H  5.609616 1.278483 2.325799
H  7.12837 0.380501 2.29294
H  4.152533 1.392799 -1.050228
H  4.003949 -1.784121 1.815224
H  1.770581 1.233504 -1.360277
H  1.615212 -1.959674 1.498411
H  0.665387 0.518058 2.381354
H  -3.738917 2.547121 3.220434
H  -1.678399 -0.888976 -3.820194
H  -3.229525 -1.05705 -2.979087
H  -0.01422 1.058967 4.669858
H  -2.231163 2.088536 5.087739
H  -1.07611 -3.229258 -3.19494
H  -2.574176 -3.374807 -2.261231
H  -3.37336 -4.762264 -5.50164
H  -1.801016 -4.996159 -4.717121
H  -3.295336 -5.178578 -3.780415
totalener: -1584.33376161 hartree
nucrepener: 3337.57020199 hartree
electener: -4921.90396360 hartree
oneelecener: -8804.73294082 hartree
twoeener: 3882.82897722 hartree
kineticenergy: 1577.95376145 hartree
xcener: -146.962738617258 hartree
chargesum: -0.0000000
charge: -0.164585 -0.153126 -0.173967 -0.251443 -0.261108 -0.303245 -0.320025 0.026261 0.242117 -0.074643 -0.292346 -0.335377 -0.292828 0.771556 -0.179190 -0.139508 -0.094021 -0.096681 -0.267106 0.124579 0.276728 0.125223 -0.471791 -0.241414 -0.196769 -0.036706 0.531750 0.007507 -0.094626 -0.130746 0.016046 -0.111884 0.103923 0.088475 0.087680 0.091719 0.093790 0.101624 0.087630 0.099449 0.089259 0.123908 0.111345 0.132375 0.136908 0.168243 0.133232 0.101605 0.108419 0.132699 0.134277 0.085903 0.076347 0.109049 0.082016 0.081493
qa: -0.1646 -0.1531 -0.1740 -0.2514 -0.2611 -0.3032 -0.3200 0.0263 0.2421 -0.0746 -0.2923 -0.3354 -0.2928 0.7716 -0.1792 -0.1395 -0.0940 -0.0967 -0.2671 0.1246 0.2767 0.1252 -0.4718 -0.2414 -0.1968 -0.0367 0.5317 0.0075 -0.0946 -0.1307 0.0160 -0.1119 0.1039 0.0885 0.0877 0.0917 0.0938 0.1016 0.0876 0.0994 0.0893 0.1239 0.1113 0.1324 0.1369 0.1682 0.1332 0.1016 0.1084 0.1327 0.1343 0.0859 0.0763 0.1090 0.0820 0.0815
va: 1.1393 1.1495 1.1270 2.1626 2.1866 2.1981 1.9852 3.1209 3.7830 3.8078 3.9214 3.9318 3.9224 3.2134 3.8206 3.9959 4.0373 4.0808 4.0529 3.9007 4.2944 3.4591 4.1502 4.0371 3.9861 3.8873 4.4579 3.8644 3.9921 3.9748 3.9306 3.9409 1.0053 1.0060 1.0078 1.0113 1.0026 1.0019 1.0070 1.0064 1.0068 1.0045 1.0124 1.0265 1.0242 0.9854 1.0147 1.0157 1.0059 1.0014 1.0002 0.9991 0.9940 0.9946 0.9906 0.9897
dispcorr: -0.030572132 hartree
energy: -1584.364333739712
dipole: 54.81142 -53.70659 1.10483 -24.29539 24.14123 -0.15416 -3.67471 4.82906 1.15434
magnitude: 1.60528 au
magnitude: 4.08030 debye
