program: Orca
programVersion: 5.0.2
elementType: F F F O O O O N C C C C C C C C C C C C C C C C C C C C C C C C H H H H H H H H H H H H H H H H H H H H H H H H
charge: 0
multiplicity: 1
keywords: wb97x-d3
keywords: def2-TZVPP
keywords: def2/J RIJCOSX
keywords: DEFGRID2
keywords: scfconv7
keywords: smallprint printgap noloewdin
keywords: NOSOSCF
formula: C24H24F3NO4
InChI: InChI=1/C24H24F3NO4/c1-22(2,3)16-9-11-17(12-10-16)23(15-28,21(30)32-14-13-31-4)20(29)18-7-5-6-8-19(18)24(25,26)27/h5-12H,13-14H2,1-4H3
56 atoms
F  -4.646322 1.481403 0.900307
F  -3.313869 0.22193 -0.217265
F  -3.330097 2.352645 -0.551381
O  -1.319707 -1.701117 -1.594198
O  -0.706264 1.259997 -1.108219
O  0.781576 -1.445879 -2.324674
O  -3.806978 -3.095205 -3.815177
N  -0.897438 -2.28293 1.695627
C  5.877138 0.285753 0.846253
C  4.396503 -0.003436 0.632279
C  6.471365 -0.54706 1.981733
C  6.645625 -0.037701 -0.441939
C  6.058459 1.769748 1.191554
C  0.169762 -0.710311 -0.090949
C  1.651561 -0.481458 0.172354
C  3.695331 0.663916 -0.373921
C  3.682587 -0.918339 1.395999
C  2.354039 0.433645 -0.607973
C  2.332304 -1.155555 1.173635
C  -0.569407 0.659823 -0.08218
C  -0.058807 -1.331335 -1.488595
C  -1.035243 1.187957 1.236922
C  -0.431415 -1.589568 0.906837
C  -2.362571 1.575036 1.452353
C  -0.107247 1.334152 2.261413
C  -2.729936 2.097551 2.683059
C  -3.41456 1.411081 0.387317
C  -1.760146 -2.259559 -2.834285
C  -0.480942 1.873005 3.48171
C  -1.793126 2.253371 3.692845
C  -3.26317 -2.461425 -2.694201
C  -3.990363 -2.263164 -4.92793
H  7.529625 -0.309957 2.098416
H  5.9874 -0.3427 2.938349
H  6.400342 -1.618118 1.785571
H  6.302827 0.560394 -1.286634
H  6.532702 -1.08751 -0.715201
H  7.710562 0.163206 -0.310555
H  5.524839 2.030018 2.106735
H  5.694152 2.424659 0.399569
H  7.114968 1.998686 1.343571
H  4.204261 1.384352 -1.001772
H  4.168611 -1.472712 2.18645
H  1.863646 0.973757 -1.405858
H  1.820986 -1.876581 1.798364
H  0.921663 1.042099 2.103757
H  -3.755449 2.381157 2.869873
H  -1.257755 -3.211995 -3.017987
H  -1.509098 -1.580376 -3.652217
H  0.2562 1.987851 4.264446
H  -2.097524 2.664712 4.645481
H  -3.460884 -3.106212 -1.835325
H  -3.748048 -1.495334 -2.496456
H  -4.543046 -2.831512 -5.674655
H  -4.572463 -1.366675 -4.679867
H  -3.049583 -1.93586 -5.386224
totalener: -1584.33270631 hartree
nucrepener: 3362.72410176 hartree
electener: -4947.05680806 hartree
oneelecener: -8854.83668593 hartree
twoeener: 3907.77987787 hartree
kineticenergy: 1577.96390246 hartree
xcener: -146.964712482400 hartree
chargesum: 0.0000000
charge: -0.171663 -0.168759 -0.153929 -0.253180 -0.255634 -0.302687 -0.321100 0.024830 0.246109 -0.086093 -0.334227 -0.289593 -0.291949 0.768367 -0.212999 -0.149953 -0.082229 -0.136601 -0.186345 0.120159 0.284639 0.096964 -0.455814 -0.235346 -0.167428 -0.042917 0.537773 -0.012811 -0.100079 -0.123816 0.027510 -0.108472 0.092084 0.094152 0.098103 0.089855 0.103453 0.087940 0.096752 0.090324 0.089356 0.112548 0.123194 0.133696 0.127392 0.155283 0.133292 0.105255 0.095092 0.131798 0.134479 0.101486 0.069986 0.110608 0.081912 0.079237
qa: -0.1717 -0.1688 -0.1539 -0.2532 -0.2556 -0.3027 -0.3211 0.0248 0.2461 -0.0861 -0.3342 -0.2896 -0.2919 0.7684 -0.2130 -0.1500 -0.0822 -0.1366 -0.1863 0.1202 0.2846 0.0970 -0.4558 -0.2353 -0.1674 -0.0429 0.5378 -0.0128 -0.1001 -0.1238 0.0275 -0.1085 0.0921 0.0942 0.0981 0.0899 0.1035 0.0879 0.0968 0.0903 0.0894 0.1125 0.1232 0.1337 0.1274 0.1553 0.1333 0.1053 0.0951 0.1318 0.1345 0.1015 0.0700 0.1106 0.0819 0.0792
va: 1.1319 1.1364 1.1500 2.1667 2.1870 2.2062 1.9913 3.1182 3.7852 3.8200 3.9313 3.9225 3.9231 3.2196 3.8487 4.0835 3.9334 4.0911 4.0270 3.8792 4.2716 3.4749 4.1381 4.0137 3.9817 3.9004 4.4426 3.8468 3.9937 3.9672 3.9672 3.9383 1.0118 1.0026 1.0025 1.0079 1.0058 1.0058 1.0069 1.0074 1.0064 1.0109 1.0055 1.0239 1.0295 0.9962 1.0140 1.0025 1.0027 1.0017 0.9999 0.9983 1.0118 0.9942 0.9933 0.9807
dispcorr: -0.031333142 hartree
energy: -1584.364039450655
dipole: 52.01616 -50.92065 1.09551 -7.39350 8.47409 1.08059 -3.04688 3.87475 0.82787
magnitude: 1.74733 au
magnitude: 4.44136 debye
