program: Orca
programVersion: 5.0.2
elementType: F F F O O O O N C C C C C C C C C C C C C C C C C C C C C C C C H H H H H H H H H H H H H H H H H H H H H H H H
charge: 0
multiplicity: 1
keywords: wb97x-d3
keywords: def2-TZVPP
keywords: def2/J RIJCOSX
keywords: DEFGRID2
keywords: scfconv7
keywords: smallprint printgap noloewdin
keywords: NOSOSCF
formula: C24H24F3NO4
InChI: InChI=1/C24H24F3NO4/c1-22(2,3)16-9-11-17(12-10-16)23(15-28,21(30)32-14-13-31-4)20(29)18-7-5-6-8-19(18)24(25,26)27/h5-12H,13-14H2,1-4H3
56 atoms
F  -4.627914 1.719306 0.970743
F  -3.377879 0.527345 -0.299678
F  -3.179174 2.67845 -0.283386
O  -1.324195 -1.521302 -1.733924
O  -0.713253 1.330608 -0.946465
O  0.790981 -1.256057 -2.41806
O  -3.783608 -2.743812 -4.083215
N  -0.853115 -2.498663 1.475445
C  5.89002 0.221637 0.830322
C  4.407163 -0.050943 0.610812
C  6.640933 -0.011314 -0.487487
C  6.083242 1.675839 1.279736
C  6.494931 -0.691647 1.896382
C  0.175919 -0.718326 -0.129577
C  1.658953 -0.50129 0.140059
C  3.685264 0.716118 -0.30541
C  3.713008 -1.053276 1.276305
C  2.342022 0.501732 -0.542753
C  2.361897 -1.278409 1.046826
C  -0.584287 0.633085 0.018046
C  -0.05525 -1.196786 -1.58251
C  -1.075477 1.018511 1.37486
C  -0.403788 -1.711743 0.768777
C  -2.370084 1.50834 1.591284
C  -0.193776 0.933765 2.447086
C  -2.745318 1.900834 2.867407
C  -3.387118 1.60997 0.483691
C  -1.752712 -1.969832 -3.021992
C  -0.574109 1.342482 3.714274
C  -1.851923 1.825347 3.924476
C  -3.256577 -2.183406 -2.916099
C  -3.934156 -1.846586 -5.14922
H  6.284381 0.642304 -1.284004
H  7.707754 0.18161 -0.358046
H  6.524139 -1.040295 -0.829836
H  5.562201 1.87252 2.217891
H  5.715288 2.389271 0.54196
H  7.142948 1.886948 1.435049
H  6.430635 -1.74546 1.620335
H  6.013703 -0.56337 2.867624
H  7.552286 -0.456942 2.025987
H  4.179296 1.503667 -0.860096
H  4.215632 -1.687255 1.992969
H  1.834975 1.121239 -1.269174
H  1.867777 -2.072799 1.591414
H  0.810941 0.566156 2.292259
H  -3.745954 2.263275 3.052732
H  -1.248994 -2.903712 -3.281903
H  -1.492268 -1.222878 -3.775259
H  0.129815 1.276122 4.5324
H  -2.164664 2.137197 4.911651
H  -3.46335 -2.884824 -2.105081
H  -3.74773 -1.233791 -2.661224
H  -4.504074 -0.954905 -4.859484
H  -2.980275 -1.511729 -5.573644
H  -4.484209 -2.361189 -5.935722
totalener: -1584.33275661 hartree
nucrepener: 3352.29592233 hartree
electener: -4936.62867895 hartree
oneelecener: -8833.98805868 hartree
twoeener: 3897.35937974 hartree
kineticenergy: 1577.96244000 hartree
xcener: -146.964978649008 hartree
chargesum: -0.0000000
charge: -0.173029 -0.169303 -0.153008 -0.256515 -0.264319 -0.300941 -0.320320 0.027880 0.242543 -0.078809 -0.288614 -0.291479 -0.334383 0.774980 -0.208660 -0.155725 -0.083885 -0.129229 -0.194808 0.135075 0.281688 0.102556 -0.461936 -0.238883 -0.192742 -0.035534 0.534117 -0.013287 -0.094410 -0.128027 0.027473 -0.109843 0.089946 0.087985 0.103055 0.097315 0.089870 0.089032 0.095974 0.095910 0.092261 0.111888 0.122979 0.135788 0.129987 0.163183 0.133514 0.105796 0.095857 0.132478 0.134728 0.100091 0.071138 0.082153 0.079841 0.110608
qa: -0.1730 -0.1693 -0.1530 -0.2565 -0.2643 -0.3009 -0.3203 0.0279 0.2425 -0.0788 -0.2886 -0.2915 -0.3344 0.7750 -0.2087 -0.1557 -0.0839 -0.1292 -0.1948 0.1351 0.2817 0.1026 -0.4619 -0.2389 -0.1927 -0.0355 0.5341 -0.0133 -0.0944 -0.1280 0.0275 -0.1098 0.0899 0.0880 0.1031 0.0973 0.0899 0.0890 0.0960 0.0959 0.0923 0.1119 0.1230 0.1358 0.1300 0.1632 0.1335 0.1058 0.0959 0.1325 0.1347 0.1001 0.0711 0.0822 0.0798 0.1106
va: 1.1286 1.1370 1.1496 2.1639 2.1804 2.2080 1.9911 3.1194 3.7883 3.8139 3.9233 3.9228 3.9309 3.2178 3.8631 4.0912 3.9321 4.0936 4.0312 3.8735 4.2699 3.4782 4.1525 4.0242 3.9906 3.8856 4.4476 3.8443 3.9913 3.9738 3.9679 3.9386 1.0078 1.0055 1.0061 1.0065 1.0077 1.0065 1.0028 1.0026 1.0118 1.0112 1.0057 1.0218 1.0278 0.9924 1.0147 1.0026 1.0018 1.0015 1.0000 0.9981 1.0101 0.9930 0.9805 0.9943
dispcorr: -0.030935187 hartree
energy: -1584.363691799730
dipole: 51.91523 -50.85676 1.05847 -8.91029 9.85516 0.94487 -3.93005 4.86540 0.93535
magnitude: 1.69941 au
magnitude: 4.31957 debye
