program: Orca
programVersion: 5.0.2
elementType: F F F O O O O N C C C C C C C C C C C C C C C C C C C C C C C C H H H H H H H H H H H H H H H H H H H H H H H H
charge: 0
multiplicity: 1
keywords: wb97x-d3
keywords: def2-TZVPP
keywords: def2/J RIJCOSX
keywords: DEFGRID2
keywords: scfconv7
keywords: smallprint printgap noloewdin
keywords: NOSOSCF
formula: C24H24F3NO4
InChI: InChI=1/C24H24F3NO4/c1-22(2,3)16-9-11-17(12-10-16)23(15-28,21(30)32-14-13-31-4)20(29)18-7-5-6-8-19(18)24(25,26)27/h5-12H,13-14H2,1-4H3
56 atoms
F  -3.448288 2.196622 -0.35997
F  -4.658438 1.188974 1.094455
F  -3.288549 0.063002 -0.117334
O  -1.306092 -1.607182 -1.693187
O  -0.750286 1.292322 -1.034476
O  0.790649 -1.308817 -2.420597
O  -3.848729 -2.762663 -3.98633
N  -0.818585 -2.404221 1.561967
C  5.906252 0.295511 0.748375
C  4.422455 0.010563 0.550319
C  6.090778 1.754625 1.18521
C  6.53221 -0.605958 1.81237
C  6.64571 0.060101 -0.575466
C  0.191628 -0.708059 -0.143101
C  1.67287 -0.468417 0.114964
C  3.733467 -0.959986 1.266648
C  3.692668 0.73659 -0.393069
C  2.381225 -1.197279 1.056839
C  2.349188 0.506005 -0.615088
C  -0.577714 0.641072 -0.045469
C  -0.0441 -1.247317 -1.573656
C  -1.028382 1.087325 1.308781
C  -0.378506 -1.657041 0.807801
C  -2.365514 1.397815 1.580263
C  -0.075184 1.236945 2.309416
C  -2.717306 1.851981 2.842305
C  -3.442166 1.216479 0.542031
C  -1.768716 -2.060597 -2.967398
C  -0.434988 1.706501 3.56219
C  -1.756298 2.013041 3.82867
C  -3.275519 -2.234249 -2.826171
C  -4.032276 -1.835645 -5.021382
H  5.581713 1.951554 2.129841
H  7.150226 1.978974 1.32322
H  5.702654 2.45789 0.447872
H  6.462281 -1.662472 1.548212
H  6.071098 -0.467891 2.791867
H  7.591831 -0.369709 1.918649
H  6.531227 -0.970906 -0.912358
H  7.712569 0.258617 -0.45594
H  6.280872 0.708554 -1.372368
H  4.241566 -1.559539 2.008729
H  4.181307 1.502109 -0.982498
H  1.891273 -1.964294 1.642537
H  1.836516 1.090929 -1.366115
H  0.960629 1.001359 2.107828
H  -3.748747 2.076138 3.072488
H  -1.291679 -3.008667 -3.225447
H  -1.50682 -1.328751 -3.734827
H  0.320603 1.82568 4.326671
H  -2.048363 2.370075 4.806757
H  -3.481547 -2.938653 -2.017502
H  -3.731776 -1.274439 -2.548028
H  -4.589991 -0.951693 -4.687315
H  -3.09199 -1.489747 -5.466854
H  -4.609384 -2.326727 -5.80355
totalener: -1584.33267224 hartree
nucrepener: 3366.64602770 hartree
electener: -4950.97869994 hartree
oneelecener: -8862.67621634 hartree
twoeener: 3911.69751640 hartree
kineticenergy: 1577.96042965 hartree
xcener: -146.963797971174 hartree
chargesum: -0.0000000
charge: -0.155757 -0.171336 -0.168931 -0.252833 -0.255059 -0.301800 -0.321641 0.023744 0.244655 -0.083897 -0.291511 -0.334814 -0.289415 0.770510 -0.227505 -0.085664 -0.149154 -0.175190 -0.137396 0.124486 0.283061 0.094128 -0.451465 -0.236278 -0.163749 -0.043164 0.541172 -0.011213 -0.100197 -0.124790 0.026028 -0.108099 0.096557 0.089340 0.090068 0.098302 0.094276 0.092091 0.103815 0.087941 0.089475 0.123618 0.112579 0.126891 0.133510 0.152405 0.132528 0.105918 0.094215 0.132019 0.134154 0.102450 0.069239 0.082274 0.078932 0.110475
qa: -0.1558 -0.1713 -0.1689 -0.2528 -0.2551 -0.3018 -0.3216 0.0237 0.2447 -0.0839 -0.2915 -0.3348 -0.2894 0.7705 -0.2275 -0.0857 -0.1492 -0.1752 -0.1374 0.1245 0.2831 0.0941 -0.4515 -0.2363 -0.1637 -0.0432 0.5412 -0.0112 -0.1002 -0.1248 0.0260 -0.1081 0.0966 0.0893 0.0901 0.0983 0.0943 0.0921 0.1038 0.0879 0.0895 0.1236 0.1126 0.1269 0.1335 0.1524 0.1325 0.1059 0.0942 0.1320 0.1342 0.1025 0.0692 0.0823 0.0789 0.1105
va: 1.1480 1.1328 1.1360 2.1676 2.1873 2.2068 1.9920 3.1183 3.7880 3.8188 3.9228 3.9316 3.9227 3.2138 3.8426 3.9388 4.0817 4.0268 4.0828 3.8744 4.2752 3.4814 4.1316 4.0120 3.9793 3.9053 4.4380 3.8443 3.9927 3.9677 3.9687 3.9379 1.0069 1.0065 1.0074 1.0025 1.0025 1.0118 1.0058 1.0057 1.0081 1.0054 1.0110 1.0294 1.0236 0.9981 1.0140 1.0022 1.0035 1.0016 1.0000 0.9983 1.0130 0.9933 0.9808 0.9942
dispcorr: -0.031486296 hartree
energy: -1584.364158535280
dipole: 52.32986 -51.21777 1.11209 -5.15796 6.26551 1.10756 -4.66533 5.53476 0.86943
magnitude: 1.79425 au
magnitude: 4.56062 debye
